{"text_format":"1","workbook":"xlsx","n_sheets":6,"sheets":["ANASAYFA","veriler","ücret onayı","Pansiyon","işletme","DYK"],"not_rendered":{"charts":0,"images":0,"macros":1,"external_links":0,"defined_names":7,"comments":0,"pivot_tables":0},"unopened":[],"bounds":{"document_bytes":16777216,"sheet_cells":100000,"rows_first":2000,"rows_last":500,"rows_between":2000,"halvings":0,"cell_chars":16384,"cell_head_chars":4096},"cells_cut":0,"cells_raw":0,"read":"whole","date_system":"1900"}

{"sheet":"ANASAYFA","index":0,"n_rows":39,"n_cols":12,"rows_kept":39,"cut":false,"hidden":false,"merged":[[0,0,0,2],[1,0,1,2],[9,0,9,2],[19,0,19,2]]}
["EKDERS ÜCRET ONAY PROGRAMI"]
["ONAY ALINACAK KURUM BİLGİLERİ",null,null,"KURUM PANSİYONLU MU","İŞLETMELERDE BECERİ EĞİTİMİ VAR MI"]
["İL (İL MERKEZİNDE İSENİZ YAZINIZ)",null,null,"Evet","Evet",null,null,null,null,null,null,{"$f":"IF(B3=\"\",B4&\" KAYMAKAMLIĞI\",B3&\" VALİLİĞİ\")","v":"ULUBORLU KAYMAKAMLIĞI"}]
["İLÇE ADI (İLÇEDE İSENİZ YAZINIZ)","ULUBORLU",null,null,null,null,null,null,null,null,null,{"$f":"IF(B3=\"\",\"İLÇE MİLLİ EĞİTİM MÜDÜRLÜĞÜ\",\"İL MİLLİ EĞİTİM MÜDÜRLÜĞÜ\")","v":"İLÇE MİLLİ EĞİTİM MÜDÜRLÜĞÜ"}]
["OKULUN ADI","ULUBORLU MESLEKİ VE TEKNİK ANADOLU LİSESİ",null,null,null,null,null,null,null,null,null,{"$f":"IF(B3=\"\",B4&\" İLÇE MİLLİ EĞİTİM MÜDÜRLÜĞÜ\",B3&\" İL MİLLİ EĞİTİM MÜDÜRLÜĞÜ\")","v":"ULUBORLU İLÇE MİLLİ EĞİTİM MÜDÜRLÜĞÜ"}]
["EĞİTİM ÖĞRETİM YILI","2019-2020",null,null,null,null,null,null,null,null,null,{"$f":"CONCATENATE(PROPER((ANASAYFA!B5)),\" \",\"Müdürlüğü\")","v":"Uluborlu Mesleki Ve Teknik Anadolu Lisesi Müdürlüğü"}]
["DÖNEM",1,null,null,null,null,null,null,null,null,null,{"$f":"L5&\"NE\"","v":"ULUBORLU İLÇE MİLLİ EĞİTİM MÜDÜRLÜĞÜNE"}]
["MALİ YIL",2020]
["AY","OCAK"]
["KATSAYILAR"]
["MEMUR MAAŞ KAT SAYISI :",0.146061]
["   EKDERS GÖSTERGE (GÜNDÜZ) :",140]
["   EKDERS GÖSTERGE (GECE) :",150]
["EKDERS GÖSTERGE (DYK GÜNDÜZ) :",280]
["EKDERS GÖSTERGE (DYK GECE) :",300]
["EKDERS GÖSTERGE (DYK H.SONU) :",300]
["ÖZEL EĞİTİM EKDERS GÖSTERGESİ :",175]
["Y.LİSANS ORANI",0.05]
["DOKTORA ORANI",0.15]
["TUTARLAR"]
["GÜNLÜK TUTAR (GÜNDÜZ) :",{"$f":"B11*B12","v":20.448540000000001}]
["GÜNLÜK TUTAR (DYK GÜNDÜZ) :",{"$f":"B11*B14","v":40.897080000000003}]
["GÜNLÜK TUTAR (DYK GECE) :",{"$f":"B15*B11","v":43.818300000000001}]
["GÜNLÜK TUTAR (DYK H SONU) :",{"$f":"B15*B11","v":43.818300000000001}]
["GÜNLÜK TUTAR ÖZEL EĞİTİM  :",{"$f":"B11*B17","v":25.560675}]
["TUTAR Y.LİSANS (GÜNDÜZ)",{"$f":"B21*B18+B21","v":21.470967000000002}]
["TUTAR DOKTORA (GÜNDÜZ)",{"$f":"B21*B19+B21","v":23.515821000000003}]
["Y LİSANS (DYK GÜNDÜZ) :",{"$f":"B11*B14+B11*B12*B18","v":41.919507000000003}]
["Y LİSANS (DYK GECE) :",{"$f":"B11*B15+B11*B13*B18","v":44.913757500000003}]
["Y LİSANS (DYK H SONU) :",{"$f":"B11*B15+B11*B13*B18","v":44.913757500000003}]
["DOKTORA (DYK GÜNDÜZ) :",{"$f":"B11*B14+B11*B12*B19","v":43.964361000000004}]
["DOKTORA (DYK GECE) :",{"$f":"B11*B15+B11*B13*B19","v":47.1046725}]
["DOKTORA (DYK H SONU) :",{"$f":"B11*B15+B11*B13*B19","v":47.1046725}]
["GÖREVLİLER","ADI SOYADI","ÜNVANI"]
["OKUL MÜDÜRÜ","Ruhi İLHAN","Okul Müdürü"]
["İLÇE MEM MÜDÜRÜ","Mustafa KABASAKAL","İlçe Milli Eğitim Müdürü"]
["ONAYLAYAN","Şahin DEMİR","Kaymakam"]
["BİRİM YETKİLİSİ :","Ramazan GÜLMEZ","Şube Müdürü"]
["DÜZENLEYEN :"]

{"sheet":"veriler","index":1,"n_rows":36,"n_cols":99,"rows_kept":36,"cut":false,"hidden":false,"merged":[[1,48,1,50],[1,51,1,53],[1,54,1,56],[1,42,1,44],[0,0,0,30],[1,0,3,0],[1,10,1,29],[1,1,1,9]]}
[null,null,null,null,null,null,null,null,null,null,null,null,null,null,null,null,null,null,null,null,null,null,null,null,null,null,null,null,null,null,null,null,null,null,null,null,null,null,null,null,null,null,null,null,null,null,{"$f":"IF(AM5>0,IF(AR5>0,AM5-AR5,AM5),0)","v":0},{"$f":"IF(AL5>0,IF(AS5>0,AL5-AS5,AL5),0)","v":0}]
[1,"PERSONEL BİLGİLERİ",null,null,null,null,null,null,null,null,"Haftalık Okutacağı\n Ders Bilgileri",null,null,null,null,null,null,null,null,null,null,null,null,null,null,null,null,null,null,null,null,null,null,null,null,null,null,null,null,null,null,null,null,null,null,null,null,null,"LİSANS",null,null,"Y.LİSANS",null,null,"DOKTORA",null,null,null,null,null,null,null,null,null,null,null,null,null,null,null,null,null,null,null,null,null,null,null,null,null,null,null,null,null,null,null,null,null,null,null,null,null,null,null,null,null,null,null,{"$f":"ANASAYFA!D3","v":"Evet"}]
[null,null,"Adı Soyadı","TC KİMLİK NO (DYK ÜCRET ONAYI İÇİN)","BRANŞI","GÖREVİ","Öğrenim Durumu","OKUTTUĞU SINIFLAR","BAŞKA KURUMDAN BELLETMEN ÖĞRETMEN İSE SEÇİNİZ","ÇALIŞTIĞI KURUM (FARKLI BİR KURUM İSE YAZINIZ)","KENDİ OKULUNDA GİRDİĞİ DESR SAATİ","BAŞKA OKULDA GİRDİĞİ DERS SAATİ","DYK GÜNDÜZ","DYK GECE","DYK H.SONU","FİİLEN GİRDİĞİ REHBERLİK SINIFI VAR MI","DDH TOPLAM DERS SAATİ (FORMÜL VARDIR )","TOPLAM DERS SAATİ (FORMÜL VARDIR)","Özel Eğitim Sınıfı  Ders Saati",null,"Öğr.Sos. Kiş.Hz.","Ders Niteliğinde Yönetim\nGörevi Ücret Saati","İkili Eğitim Ücret Saati (Yöneticiler için)","Ders Dışı Egzersiz\nGörevi Ücreti Saati","Planlama ve  Bakım / Onarım Görevi  (Bölüm ve Atölye Şefleri )","Haftalık  Nöbet Ücreti  Toplam Saati","Özel Eğitim Sınıf  Ücretli  Ders saati Toplamı","KENDİ OKULUNDAKİ ÖĞRETMENLERDEN BELLETMENLİK GÖREVİ VAR MI","KOORDİNATÖRLÜK GÖREVİ VAR MI","Toplam",null,"MAAŞ KARŞILIĞI","BAŞKA OKULLARDAKİ MAAŞ KARŞILIĞI","MAAŞ DIŞINDAKİ EKDERS REHBERLİK DAHİL","REHBERLİK HARİÇ MAAŞ DIŞINDAKİ EKDERS","NORMAL DERS",null,"DYK",null,null,"DYK MAAŞ",null,"DYK FORMUL","DYK FORMUL","DYK FORMUL","DYK GÜNDÜZ","DYK GECE","DYK H.SONU","DYK GÜNDÜZ","DYK GECE","DYK H.SONU","DYK GÜNDÜZ","DYK GECE","DYK H.SONU","DYK GÜNDÜZ","DYK GECE","DYK H.SONU","ddh","Öğr.Sos. Kiş.Hz.","Ders Niteliğinde Yönetim\nGörevi Ücret Saati","Lisans","Y.Lisans","Doktora","PANSİYON NÖBETİ","KOORDİNATÖRLÜK","KURUM BİRLEŞTİR","DİĞER OKULLARDAKİ FORMUL","DİĞER OKULLARDAKİ MAAŞ",null,"DYK GİDRİĞİ TOPLAM",null,null,"SADECE BELLETMEN"]
[null,null,1,null,2,3,4,5,null,7,8,9,10,11,12,13,12,13,14,15,15,16,17,18,19,20,21,22,23,24,25]
[null,1,"RUHİ İLHAN",null,"Coğrafya","Müdür","Lisans","9/A",null,null,null,null,null,null,null,null,null,null,null,null,null,null,null,null,null,null,null,"Hayır","Hayır",{"$f":"IF(OR(F5=$BX$5,F5=$BX$6,F5=$BX$7,F5=$BX$15,F5=$BX$11,F5=$BX$18,F5=$BX$19),SUM(K5:N5),IF(OR(F5=$BX$8,F5=$BX$9,F5=$BX$10,F5=$BX$12,F5=$BX$13,F5=$BX$16,F5=$BX$17),SUM(K5:N5)+IF(P5=\"Evet\",1,0),\"\"))","v":0},{"$f":"SUM(K5:N5)","v":0},{"$f":"IF(OR(F5=$BX$5,F5=$BX$6,F5=$BX$7),IF(AE5<=6,AE5,6),IF(OR(F5=$BX$17,F5=$BX$8),IF(AE5<=15,AE5,15),IF(OR(F5=$BX$9,F5=$BX$10),IF(AE5<=18,AE5,18),IF(OR(F5=$BX$12,F5=$BX$13,F5=$BX$16,F5=$BX$18,F5=$BX$19),IF(AE5<=20,AE5,20),IF(OR(F5=$BX$15,F5=$BX$20),IF(AE5>0,0,0),\"\")))))","v":0},{"$f":"BP5","v":0},{"$f":"IF(OR(F5=$BX$5,F5=$BX$6,F5=$BX$7),IF(AD5<=6,\"\",AD5-6),IF(OR(F5=$BX$17,F5=$BX$8),IF(AD5<=15,0,AD5-15),IF(OR(F5=$BX$9,F5=$BX$10),IF(AD5<=18,0,AD5-18),IF(OR(F5=$BX$12,F5=$BX$13,F5=$BX$16,F5=$BX$18,F5=$BX$19),IF(AD5<=20,\"\",AD5-20),IF(F5=$BX$15,IF(AD5>0,AD5,\"\"),IF(F5=$BX$20,\"\"))))))","v":""},{"$f":"IF(OR(F5=$BX$5,F5=$BX$6,F5=$BX$7),IF(AE5<=6,0,AE5-6),IF(OR(F5=$BX$17,F5=$BX$8),IF(AE5<=15,0,AE5-15),IF(OR(F5=$BX$9,F5=$BX$10),IF(AE5<=18,0,AE5-18),IF(OR(F5=$BX$12,F5=$BX$13,F5=$BX$16,F5=$BX$18,F5=$BX$19),IF(AE5<=20,0,AE5-20),IF(F5=$BX$20,0,IF(F5=$BX$15,IF(AE5>0,AE5,0),0))))))","v":0},{"$f":"IF(AI5>0,IF(OR(M5>0,N5>0),IF(AI5>0,AI5-(M5+N5),0),IF(AI5>0,AI5-(M5+N5),0)),0)","v":0},{"$f":"IF(F5=$BX$20,0,IF(AJ5<0,AI5,0))","v":0},{"$f":"IF(F5=$BX$20,SUM(M5:N5),IF(AK5>0,AK5,AI5-AJ5))","v":0},{"$f":"AL5-AU5","v":0},{"$f":"AM5-(AU5)","v":0},{"$f":"IF(AL5>=0,SUM(M5:N5)-AL5,0)","v":0},null,{"$f":"IF(AM5>0,AM5,0)","v":0},{"$f":"IF(AM5>0,AM5-M5,0)","v":0},{"$f":"IF(AL5>0,AL5-N5,0)","v":0},{"$f":"AQ5","v":0},{"$f":"IF(AL5>0,IF(AS5>0,AL5-AS5,AL5),0)","v":0},{"$f":"IF(O5>0,O5,0)","v":0},{"$f":"IF(G5=$CD$5,IF(AT5>0,AT5,0),0)","v":0},{"$f":"IF(G5=$CD$5,IF(AU5>0,AU5,0),0)","v":0},{"$f":"IF(G5=$CD$5,IF(AV5>0,AV5,0),0)","v":0},{"$f":"IF(G5=$CD$6,IF(AT5>0,AT5,0),0)","v":0},{"$f":"IF(G5=$CD$6,IF(AU5>0,AU5,0),0)","v":0},{"$f":"IF(G5=$CD$6,IF(AV5>0,AV5,0),0)","v":0},{"$f":"IF(G5=$CD$7,IF(AT5>0,AT5,0),0)","v":0},{"$f":"IF(G5=$CD$7,IF(AU5>0,AU5,0),0)","v":0},{"$f":"IF(G5=$CD$7,IF(AV5>0,AV5,0),0)","v":0},{"$f":"IF(OR(F5=$BX$5,F5=$BX$6,F5=$BX$7,F5=$BX$15,F5=$BX$11),\"\",IF(OR(F5=$BX$8,F5=$BX$9,F5=$BX$12,F5=$BX$13,F5=$BX$16,F5=$BX$17,F5=$BX$10,,F5=$BX$18,F5=$BX$19),IF(AND(Q5>=10,Q5<20),1,IF(AND(Q5>=20,Q5<30),2,IF(AND(Q5>=30,Q5=30),3,IF(Q5>30,3,\"\")))),\"\"))","v":""},{"$f":"IF(OR(F5=$BX$6,F5=$BX$6,F5=$BX$7,F5=$BX$11,F5=$BX$15,F5=$BX$18,F5=$BX$19),\"\",IF(OR(F5=$BX$8,F5=$BX$9,F5=$BX$12,F5=$BX$13,F5=$BX$16,F5=$BX$17,F5=$BX$10),U5,\"\"))","v":""},{"$f":"IF(V5>0,V5,0)","v":0},{"$f":"IF(G5=$CD$5,IF(AJ5>0,AJ5,0),0)","v":0},{"$f":"IF(G5=$CD$6,IF(AJ5>0,AJ5,0),0)","v":0},{"$f":"IF(G5=$CD$7,IF(AJ5>0,AJ5,0),0)","v":0},{"$f":"IFERROR(IF(OR(AB5=\"Evet\",I5=$BZ$14),IF(C5>0,7,0),0),0)","v":0},{"$f":"IFERROR(IF(AC5=\"Evet\",IF(C5>0,1,0),0),0)","v":0},{"$f":"IF(J5=\"\",\"\",CONCATENATE(\"(\",J5,\")\"))","v":""},{"$f":"IF(AF5>=K5,AF5-K5,0)","v":0},{"$f":"IF(BO5>L5,L5,BO5)","v":0},{"$f":"IF(SUM(K5:L5)>=AF5,AF5-(SUM(M5:O5)),SUM(K5:L5))","v":0},{"$f":"IF(SUM(veriler!M5:O5)>0,SUM(veriler!M5:O5),0)","v":0},null,null,{"$f":"IF(I5=$BZ$14,\"\",IF(C5=\"\",\"\",1))","v":1},{"$f":"IF(J5=\"\",\"\",CONCATENATE(\"(\",J5,\")\"))","v":""},null,"Müdür",6,null,null,null,null,"Lisans"]
[null,2,"A.AKİF KÖSE",null,"Elekt-Elektr.","Müdür Baş Yard","Y.Lisans","10/C-11/C",null,null,null,null,null,null,null,null,null,null,null,null,null,null,null,null,null,null,null,"Hayır","Hayır",{"$f":"IF(OR(F6=$BX$5,F6=$BX$6,F6=$BX$7,F6=$BX$15,F6=$BX$11,F6=$BX$18,F6=$BX$19),SUM(K6:N6),IF(OR(F6=$BX$8,F6=$BX$9,F6=$BX$10,F6=$BX$12,F6=$BX$13,F6=$BX$16,F6=$BX$17),SUM(K6:N6)+IF(P6=\"Evet\",1,0),\"\"))","v":0},{"$f":"SUM(K6:N6)","v":0},{"$f":"IF(OR(F6=$BX$5,F6=$BX$6,F6=$BX$7),IF(AE6<=6,AE6,6),IF(OR(F6=$BX$17,F6=$BX$8),IF(AE6<=15,AE6,15),IF(OR(F6=$BX$9,F6=$BX$10),IF(AE6<=18,AE6,18),IF(OR(F6=$BX$12,F6=$BX$13,F6=$BX$16,F6=$BX$18,F6=$BX$19),IF(AE6<=20,AE6,20),IF(OR(F6=$BX$15,F6=$BX$20),IF(AE6>0,0,0),\"\")))))","v":0},{"$f":"BP6","v":0},{"$f":"IF(OR(F6=$BX$5,F6=$BX$6,F6=$BX$7),IF(AD6<=6,\"\",AD6-6),IF(OR(F6=$BX$17,F6=$BX$8),IF(AD6<=15,0,AD6-15),IF(OR(F6=$BX$9,F6=$BX$10),IF(AD6<=18,0,AD6-18),IF(OR(F6=$BX$12,F6=$BX$13,F6=$BX$16,F6=$BX$18,F6=$BX$19),IF(AD6<=20,\"\",AD6-20),IF(F6=$BX$15,IF(AD6>0,AD6,\"\"),IF(F6=$BX$20,\"\"))))))","v":""},{"$f":"IF(OR(F6=$BX$5,F6=$BX$6,F6=$BX$7),IF(AE6<=6,0,AE6-6),IF(OR(F6=$BX$17,F6=$BX$8),IF(AE6<=15,0,AE6-15),IF(OR(F6=$BX$9,F6=$BX$10),IF(AE6<=18,0,AE6-18),IF(OR(F6=$BX$12,F6=$BX$13,F6=$BX$16,F6=$BX$18,F6=$BX$19),IF(AE6<=20,0,AE6-20),IF(F6=$BX$20,0,IF(F6=$BX$15,IF(AE6>0,AE6,0),0))))))","v":0},{"$f":"IF(AI6>0,IF(OR(M6>0,N6>0),IF(AI6>0,AI6-(M6+N6),0),IF(AI6>0,AI6-(M6+N6),0)),0)","v":0},{"$f":"IF(F6=$BX$20,0,IF(AJ6<0,AI6,0))","v":0},{"$f":"IF(F6=$BX$20,SUM(M6:N6),IF(AK6>0,AK6,AI6-AJ6))","v":0},{"$f":"AL6-AU6","v":0},{"$f":"AM6-(AU6)","v":0},{"$f":"IF(AL6>=0,SUM(M6:N6)-AL6,0)","v":0},null,{"$f":"IF(AM6>0,AM6,0)","v":0},{"$f":"IF(AM6>0,AM6-M6,0)","v":0},{"$f":"IF(AL6>0,AL6-N6,0)","v":0},{"$f":"AQ6","v":0},{"$f":"IF(AL6>0,IF(AS6>0,AL6-AS6,AL6),0)","v":0},{"$f":"IF(O6>0,O6,0)","v":0},{"$f":"IF(G6=$CD$5,IF(AT6>0,AT6,0),0)","v":0},{"$f":"IF(G6=$CD$5,IF(AU6>0,AU6,0),0)","v":0},{"$f":"IF(G6=$CD$5,IF(AV6>0,AV6,0),0)","v":0},{"$f":"IF(G6=$CD$6,IF(AT6>0,AT6,0),0)","v":0},{"$f":"IF(G6=$CD$6,IF(AU6>0,AU6,0),0)","v":0},{"$f":"IF(G6=$CD$6,IF(AV6>0,AV6,0),0)","v":0},{"$f":"IF(G6=$CD$7,IF(AT6>0,AT6,0),0)","v":0},{"$f":"IF(G6=$CD$7,IF(AU6>0,AU6,0),0)","v":0},{"$f":"IF(G6=$CD$7,IF(AV6>0,AV6,0),0)","v":0},{"$f":"IF(OR(F6=$BX$5,F6=$BX$6,F6=$BX$7,F6=$BX$15,F6=$BX$11),\"\",IF(OR(F6=$BX$8,F6=$BX$9,F6=$BX$12,F6=$BX$13,F6=$BX$16,F6=$BX$17,F6=$BX$10,,F6=$BX$18,F6=$BX$19),IF(AND(Q6>=10,Q6<20),1,IF(AND(Q6>=20,Q6<30),2,IF(AND(Q6>=30,Q6=30),3,IF(Q6>30,3,\"\")))),\"\"))","v":""},{"$f":"IF(OR(F6=$BX$6,F6=$BX$6,F6=$BX$7,F6=$BX$11,F6=$BX$15,F6=$BX$18,F6=$BX$19),\"\",IF(OR(F6=$BX$8,F6=$BX$9,F6=$BX$12,F6=$BX$13,F6=$BX$16,F6=$BX$17,F6=$BX$10),U6,\"\"))","v":""},{"$f":"IF(V6>0,V6,0)","v":0},{"$f":"IF(G6=$CD$5,IF(AJ6>0,AJ6,0),0)","v":0},{"$f":"IF(G6=$CD$6,IF(AJ6>0,AJ6,0),0)","v":0},{"$f":"IF(G6=$CD$7,IF(AJ6>0,AJ6,0),0)","v":0},0,{"$f":"IFERROR(IF(AC6=\"Evet\",IF(C6>0,1,0),0),0)","v":0},{"$f":"IF(J6=\"\",\"\",CONCATENATE(\"(\",J6,\")\"))","v":""},{"$f":"IF(AF6>=K6,AF6-K6,0)","v":0},{"$f":"IF(BO6>L6,L6,BO6)","v":0},{"$f":"IF(SUM(K6:L6)>=AF6,AF6-(SUM(M6:O6)),SUM(K6:L6))","v":0},{"$f":"IF(SUM(veriler!M6:O6)>0,SUM(veriler!M6:O6),0)","v":0},null,null,{"$f":"IF(I6=$BZ$14,\"\",IF(C6=\"\",\"\",1))","v":1},"",null,"Müdür Baş Yard",6,null,null,null,null,"Y.Lisans"]
[null,3,"ALİ OĞUR",null,"Bilgisayar","Müdür Yardımcısı","Lisans","11-C",null,null,null,null,null,null,null,null,null,null,null,null,null,null,null,null,null,null,null,"Hayır","Hayır",0,0,0,0,"",0,0,0,0,0,0,0,null,0,0,0,0,0,0,0,0,0,0,0,0,0,0,0,"","",0,0,0,0,0,0,"",0,0,0,{"$f":"IF(SUM(veriler!M7:O7)>0,SUM(veriler!M7:O7),0)","v":0},null,null,1,"",null,"Müdür Yardımcısı",6,null,null,null,null,"Doktora"]
[null,4,"ZEKİ DERELİ",null,"Beden Eğitimi","Müdür Yardımcısı","Lisans","9/A-10/B-10/C-11/A-11/C",null,null,null,null,null,null,null,null,null,null,null,null,null,null,null,null,null,null,null,"Hayır","Hayır",0,0,0,0,"",0,0,0,0,0,0,0,null,0,0,0,0,0,0,0,0,0,0,0,0,0,0,0,"","",0,0,0,0,0,0,"",0,0,0,{"$f":"IF(SUM(veriler!M8:O8)>0,SUM(veriler!M8:O8),0)","v":0},null,null,1,"",null,"Öğretmen",15]
[null,5,"MUAMMER KAYAKUŞ",null,"Elekt-Elektr.","Atölye/Lab Şefi","Lisans","10/C-11/C",null,null,null,null,null,null,null,null,null,null,null,null,null,null,null,null,null,null,null,"Evet","Evet",0,0,0,0,"",0,0,0,0,0,0,0,null,0,0,0,0,0,0,0,0,0,0,0,0,0,0,0,"","",0,0,0,0,7,1,"",0,0,0,{"$f":"IF(SUM(veriler!M9:O9)>0,SUM(veriler!M9:O9),0)","v":0},null,null,1,"",null,"Sınıf Öğretmeni",18]
[null,6,"MEHMET GÜLAY",null,"Metal İşl. ","Alan Şefi","Lisans","10/B-12/B",null,null,null,null,null,null,null,null,null,null,null,null,null,null,null,null,null,null,null,"Evet","Evet",0,0,0,0,"",0,0,0,0,0,0,0,null,0,0,0,0,0,0,0,0,0,0,0,0,0,0,0,"","",0,0,0,0,7,1,"",0,0,0,{"$f":"IF(SUM(veriler!M10:O10)>0,SUM(veriler!M10:O10),0)","v":0},null,null,1,"",null,"Sözleşmeli Sınıf Öğretmeni",18]
[null,7,"DEMET KAYA",null,"Matematik","Öğretmen","Y.Lisans","9/A-10/B-10/C-11/A-12/A-12/B",null,null,null,null,null,null,null,null,null,null,null,null,null,null,null,null,null,null,null,"Hayır","Hayır",0,0,0,0,0,0,0,0,0,0,0,0,null,0,0,0,0,0,0,0,0,0,0,0,0,0,0,0,"",0,0,0,0,0,0,0,"",0,0,0,{"$f":"IF(SUM(veriler!M11:O11)>0,SUM(veriler!M11:O11),0)","v":0},null,null,1,"",null,"Rehber Öğretmen",0]
[null,8,"ALİ ÇINAR",null,"Fizik","Öğretmen","Lisans","Keçiborlu AİHL de görevli",null,null,null,null,null,null,null,null,null,null,null,null,null,null,null,null,null,null,null,"Hayır","Hayır",0,0,0,0,0,0,0,0,0,0,0,0,null,0,0,0,0,0,0,0,0,0,0,0,0,0,0,0,"",0,0,0,0,0,0,0,"",0,0,0,{"$f":"IF(SUM(veriler!M12:O12)>0,SUM(veriler!M12:O12),0)","v":0},null,null,1,"",null,"Atelye Öğretmeni",20]
[null,9,"NEVİN AKYOL",null,"Kimya","Öğretmen","Lisans","9/A-10/B-10/C",null,null,null,null,null,null,null,null,null,null,null,null,null,null,null,null,null,null,null,"Hayır","Hayır",0,0,0,0,0,0,0,0,0,0,0,0,null,0,0,0,0,0,0,0,0,0,0,0,0,0,0,0,"",0,0,0,0,0,0,0,"",0,0,0,{"$f":"IF(SUM(veriler!M13:O13)>0,SUM(veriler!M13:O13),0)","v":0},null,null,1,"",null,"Laboratuvar Öğretmeni",20]
[null,10,"CENNET ÖZKAN",null,"İngilizce","Öğretmen","Lisans","9/A-10/B-10/C-11/A-11/C-12/A-12/B",null,null,null,null,null,null,null,null,null,null,null,null,null,null,null,null,null,null,null,"Hayır","Hayır",0,0,0,0,0,0,0,0,0,0,0,0,null,0,0,0,0,0,0,0,0,0,0,0,0,0,0,0,"",0,0,0,0,0,0,0,"",0,0,0,{"$f":"IF(SUM(veriler!M14:O14)>0,SUM(veriler!M14:O14),0)","v":0},null,null,1,"",null,"Meslek Dersi Öğretmeni",null,"Belletmen Öğretmen"]
[null,11,"NACİYE ÇIN",null,"Din Kültürü Ve Ahl.Bilgisi","Öğretmen","Lisans","9/A-10/B-10/C-11/A-11/C-12/A-12/B",null,null,null,null,null,null,null,null,null,null,null,null,null,null,null,null,null,null,null,"Hayır","Hayır",0,0,0,0,0,0,0,0,0,0,0,0,null,0,0,0,0,0,0,0,0,0,0,0,0,0,0,0,"",0,0,0,0,0,0,0,"",0,0,0,{"$f":"IF(SUM(veriler!M15:O15)>0,SUM(veriler!M15:O15),0)","v":0},null,null,1,"",null,"Ücretli Öğretmen",0]
[null,12,"KARDİYE KÖK",null,"Harita-Tapu-Kadastro","Atelye Öğretmeni","Lisans","11/A-12/A",null,null,null,null,null,null,null,null,null,null,null,null,null,null,null,null,null,null,null,"Hayır","Evet",0,0,0,0,"",0,0,0,0,0,0,0,null,0,0,0,0,0,0,0,0,0,0,0,0,0,0,0,"",0,0,0,0,0,0,1,"",0,0,0,{"$f":"IF(SUM(veriler!M16:O16)>0,SUM(veriler!M16:O16),0)","v":0},null,null,1,"",null,"Sözleşmeli Meslek",20]
[null,13,"FİDAN ERBEYLİ",null,"Türk Dili ve Edebiyatı","Öğretmen","Y.Lisans","9/A-10/B-10/C-12/A-12/B",null,null,null,null,null,null,null,null,null,null,null,null,null,null,null,null,null,null,null,"Hayır","Hayır",0,0,0,0,0,0,0,0,0,0,0,0,null,0,0,0,0,0,0,0,0,0,0,0,0,0,0,0,"",0,0,0,0,0,0,0,"",0,0,0,{"$f":"IF(SUM(veriler!M17:O17)>0,SUM(veriler!M17:O17),0)","v":0},null,null,1,"",null,"Sözleşmeli Öğretmen",15]
[null,14,"HATİCE UYSAL",null,"Metal İşl. ","Atelye Öğretmeni","Lisans","9/A-10/B-10/C-12B",null,null,null,null,null,null,null,null,null,null,null,null,null,null,null,null,null,null,null,"Hayır","Evet",0,0,0,0,"",0,0,0,0,0,0,0,null,0,0,0,0,0,0,0,0,0,0,0,0,0,0,0,"",0,0,0,0,0,0,1,"",0,0,0,{"$f":"IF(SUM(veriler!M18:O18)>0,SUM(veriler!M18:O18),0)","v":0},null,null,1,"",null,"Alan Şefi",20]
[null,15,"ÜMMÜ NUR ŞEN",null,"Fizik","Ücretli Öğretmen","Lisans","9/A-10/B-10C",null,null,null,null,null,null,null,null,null,null,null,null,null,null,null,null,null,null,null,"Hayır","Hayır",0,0,0,0,"",0,0,0,0,0,0,0,null,0,0,0,0,0,0,0,0,0,0,0,0,0,0,0,"","",0,0,0,0,0,0,"",0,0,0,{"$f":"IF(SUM(veriler!M19:O19)>0,SUM(veriler!M19:O19),0)","v":0},null,null,1,"",null,"Atölye/Lab Şefi",20]
[null,16,"SONER DOĞANAY",null,"Beden Eğitimi","Sınıf Öğretmeni","Lisans",null,"Belletmen Öğretmen","Çakır Hasan Ortaokulu",null,null,null,null,null,null,null,null,null,null,null,null,null,null,null,null,null,null,null,0,0,0,0,0,0,0,0,0,0,0,0,null,0,0,0,0,0,0,0,0,0,0,0,0,0,0,0,"",0,0,0,0,0,{"$f":"IFERROR(IF(OR(AB20=\"Evet\",I20=$BZ$14),IF(C20>0,7,0),0),0)","v":7},0,"(Çakır Hasan Ortaokulu)",0,0,0,{"$f":"IF(SUM(veriler!M20:O20)>0,SUM(veriler!M20:O20),0)","v":0},null,null,"",{"$f":"IF(J20=\"\",\"\",CONCATENATE(\"(\",J20,\")\"))","v":"(Çakır Hasan Ortaokulu)"},null,"B.T.Formatör Öğrt."]
[null,17,null,null,null,null,null,null,null,null,null,null,null,null,null,null,null,null,null,null,null,null,null,null,null,null,null,null,null,"",0,"",{"$error":"#VALUE!"},false,0,0,0,0,0,0,0,null,0,0,0,0,0,0,0,0,0,0,0,0,0,0,0,"","",0,0,0,0,{"$f":"IFERROR(IF(OR(AB21=\"Evet\",I21=$BZ$14),IF(C21>0,7,0),0),0)","v":0},0,"",{"$error":"#VALUE!"},{"$error":"#VALUE!"},0,{"$f":"IF(SUM(veriler!M21:O21)>0,SUM(veriler!M21:O21),0)","v":0},null,null,"",{"$f":"IF(J21=\"\",\"\",CONCATENATE(\"(\",J21,\")\"))","v":""}]
[null,18,null,null,null,null,null,null,null,null,null,null,null,null,null,null,null,null,null,null,null,null,null,null,null,null,null,null,null,"",0,"",{"$error":"#VALUE!"},false,0,0,0,0,0,0,0,null,0,0,0,0,0,0,0,0,0,0,0,0,0,0,0,"","",0,0,0,0,0,0,"",{"$error":"#VALUE!"},{"$error":"#VALUE!"},0,{"$f":"IF(SUM(veriler!M22:O22)>0,SUM(veriler!M22:O22),0)","v":0},null,null,"",""]
[null,19,null,null,null,null,null,null,null,null,null,null,null,null,null,null,null,null,null,null,null,null,null,null,null,null,null,null,null,"",0,"",{"$error":"#VALUE!"},false,0,0,0,0,0,0,0,null,0,0,0,0,0,0,0,0,0,0,0,0,0,0,0,"","",0,0,0,0,0,0,"",{"$error":"#VALUE!"},{"$error":"#VALUE!"},0,{"$f":"IF(SUM(veriler!M23:O23)>0,SUM(veriler!M23:O23),0)","v":0},null,null,"",""]
[null,20,null,null,null,null,null,null,null,null,null,null,null,null,null,null,null,null,null,null,null,null,null,null,null,null,null,null,null,"",0,"",{"$error":"#VALUE!"},false,0,0,0,0,0,0,0,null,0,0,0,0,0,0,0,0,0,0,0,0,0,0,0,"","",0,0,0,0,0,0,"",{"$error":"#VALUE!"},{"$error":"#VALUE!"},0,{"$f":"IF(SUM(veriler!M24:O24)>0,SUM(veriler!M24:O24),0)","v":0},null,null,"",""]
[null,21,null,null,null,null,null,null,null,null,null,null,null,null,null,null,null,null,null,null,null,null,null,null,null,null,null,null,null,"",0,"",{"$error":"#VALUE!"},false,0,0,0,0,0,0,0,null,0,0,0,0,0,0,0,0,0,0,0,0,0,0,0,"","",0,0,0,0,0,0,"",{"$error":"#VALUE!"},{"$error":"#VALUE!"},0,{"$f":"IF(SUM(veriler!M25:O25)>0,SUM(veriler!M25:O25),0)","v":0},null,null,"",""]
[null,22,null,null,null,null,null,null,null,null,null,null,null,null,null,null,null,null,null,null,null,null,null,null,null,null,null,null,null,"",0,"",{"$error":"#VALUE!"},false,0,0,0,0,0,0,0,null,0,0,0,0,0,0,0,0,0,0,0,0,0,0,0,"","",0,0,0,0,0,0,"",{"$error":"#VALUE!"},{"$error":"#VALUE!"},0,{"$f":"IF(SUM(veriler!M26:O26)>0,SUM(veriler!M26:O26),0)","v":0},null,null,"",""]
[null,23,null,null,null,null,null,null,null,null,null,null,null,null,null,null,null,null,null,null,null,null,null,null,null,null,null,null,null,"",0,"",{"$error":"#VALUE!"},false,0,0,0,0,0,0,0,null,0,0,0,0,0,0,0,0,0,0,0,0,0,0,0,"","",0,0,0,0,0,0,"",{"$error":"#VALUE!"},{"$error":"#VALUE!"},0,{"$f":"IF(SUM(veriler!M27:O27)>0,SUM(veriler!M27:O27),0)","v":0},null,null,"",""]
[null,24,null,null,null,null,null,null,null,null,null,null,null,null,null,null,null,null,null,null,null,null,null,null,null,null,null,null,null,"",0,"",{"$error":"#VALUE!"},false,0,0,0,0,0,0,0,null,0,0,0,0,0,0,0,0,0,0,0,0,0,0,0,"","",0,0,0,0,0,0,"",{"$error":"#VALUE!"},{"$error":"#VALUE!"},0,{"$f":"IF(SUM(veriler!M28:O28)>0,SUM(veriler!M28:O28),0)","v":0},null,null,"",""]
[null,25,null,null,null,null,null,null,null,null,null,null,null,null,null,null,null,null,null,null,null,null,null,null,null,null,null,null,null,"",0,"",{"$error":"#VALUE!"},false,0,0,0,0,0,0,0,null,0,0,0,0,0,0,0,0,0,0,0,0,0,0,0,"","",0,0,0,0,0,0,"",{"$error":"#VALUE!"},{"$error":"#VALUE!"},0,{"$f":"IF(SUM(veriler!M29:O29)>0,SUM(veriler!M29:O29),0)","v":0},null,null,"",""]
[null,26,null,null,null,null,null,null,null,null,null,null,null,null,null,null,null,null,null,null,null,null,null,null,null,null,null,null,null,"",0,"",{"$error":"#VALUE!"},false,0,0,0,0,0,0,0,null,0,0,0,0,0,0,0,0,0,0,0,0,0,0,0,"","",0,0,0,0,0,0,"",{"$error":"#VALUE!"},{"$error":"#VALUE!"},0,{"$f":"IF(SUM(veriler!M30:O30)>0,SUM(veriler!M30:O30),0)","v":0},null,null,"",""]
[null,27,null,null,null,null,null,null,null,null,null,null,null,null,null,null,null,null,null,null,null,null,null,null,null,null,null,null,null,"",0,"",{"$error":"#VALUE!"},false,0,0,0,0,0,0,0,null,0,0,0,0,0,0,0,0,0,0,0,0,0,0,0,"","",0,0,0,0,0,0,"",{"$error":"#VALUE!"},{"$error":"#VALUE!"},0,{"$f":"IF(SUM(veriler!M31:O31)>0,SUM(veriler!M31:O31),0)","v":0},null,null,"",""]
[null,28,null,null,null,null,null,null,null,null,null,null,null,null,null,null,null,null,null,null,null,null,null,null,null,null,null,null,null,"",0,"",{"$error":"#VALUE!"},false,0,0,0,0,0,0,0,null,0,0,0,0,0,0,0,0,0,0,0,0,0,0,0,"","",0,0,0,0,0,0,"",{"$error":"#VALUE!"},{"$error":"#VALUE!"},0,{"$f":"IF(SUM(veriler!M32:O32)>0,SUM(veriler!M32:O32),0)","v":0},null,null,"",""]
[null,29,null,null,null,null,null,null,null,null,null,null,null,null,null,null,null,null,null,null,null,null,null,null,null,null,null,null,null,"",0,"",{"$error":"#VALUE!"},false,0,0,0,0,0,0,0,null,0,0,0,0,0,0,0,0,0,0,0,0,0,0,0,"","",0,0,0,0,0,0,"",{"$error":"#VALUE!"},{"$error":"#VALUE!"},0,{"$f":"IF(SUM(veriler!M33:O33)>0,SUM(veriler!M33:O33),0)","v":0},null,null,"",""]
[null,30,null,null,null,null,null,null,null,null,null,null,null,null,null,null,null,null,null,null,null,null,null,null,null,null,null,null,null,"",0,"",{"$error":"#VALUE!"},false,0,0,0,0,0,0,0,null,0,0,0,0,0,0,0,0,0,0,0,0,0,0,0,"","",0,0,0,0,0,0,"",{"$error":"#VALUE!"},{"$error":"#VALUE!"},0,{"$f":"IF(SUM(veriler!M34:O34)>0,SUM(veriler!M34:O34),0)","v":0},null,null,"",""]
[2,31,null,null,null,null,null,null,null,null,null,null,null,null,null,null,null,null,null,null,null,null,null,null,null,null,null,null,null,null,null,null,null,null,null,null,null,null,null,null,null,null,null,null,null,null,null,null,null,null,null,null,null,null,null,null,null,null,null,null,null,null,null,null,null,null,null,null,null,null,null,null,"",""]
[null,32]

{"sheet":"ücret onayı","index":2,"n_rows":62,"n_cols":44,"rows_kept":62,"cut":false,"hidden":false,"merged":[[44,17,44,35],[46,17,49,35],[60,17,60,35],[61,17,61,35],[53,34,53,35],[57,17,57,35],[58,17,58,35],[46,1,49,15],[52,14,52,15],[53,14,53,15],[35,17,35,35],[36,17,36,35],[37,17,37,35],[52,34,52,35],[39,18,39,21],[35,1,35,15],[36,1,36,15],[37,1,37,15],[39,14,39,15],[43,1,43,15],[40,18,40,21],[39,34,39,35],[43,17,43,35],[1,16,2,16],[1,17,2,17],[1,18,2,18],[1,29,2,29],[1,23,2,23],[1,24,2,24],[1,25,2,25],[1,20,2,20],[1,21,2,21],[1,22,2,22],[1,26,2,26],[0,1,0,35],[1,27,2,27],[1,28,2,28],[1,30,2,30],[1,31,2,31],[1,32,2,32],[1,33,2,33],[1,34,2,34],[1,1,3,1],[1,2,2,2],[1,3,2,3],[1,5,1,13],[1,19,2,19],[1,4,2,4],[1,14,2,14],[1,15,2,15],[65,21,65,26],[67,2,67,12],[67,13,67,14],[62,22,62,27],[63,21,63,26],[64,21,64,26]]}
[null,{"$f":"CONCATENATE(ANASAYFA!B5,\" \",ANASAYFA!B6,\" \",\"ÖĞRETİM YILI\",\" \",ANASAYFA!B7,\". DÖNEM\",\" \",\"ÜCRETLİ DERS OKUTAN YÖNETİCİ VE ÖĞRETMENLERİN EK DERS ÜCRETLERİNİ GÖSTERİR ÇİZELGE\")","v":"ULUBORLU MESLEKİ VE TEKNİK ANADOLU LİSESİ 2019-2020 ÖĞRETİM YILI 1. DÖNEM ÜCRETLİ DERS OKUTAN YÖNETİCİ VE ÖĞRETMENLERİN EK DERS ÜCRETLERİNİ GÖSTERİR ÇİZELGE"}]
[null,"S.N","Adı Soyadı","Görevi \nve \nBranşı","ÖĞRENİM DURUMU","Haftalık Okutacağı\n Derslerin",null,null,null,null,null,null,null,null,"Okuttuğu Sınıflar","Ders Niteliğinde Yönetim\nGörevi Ücret Saati","İkili Eğitim Ücret Saati (Yöneticiler için)","Ders Dışı Egzersiz\nGörevi Ücreti Saati","Palanlama ve  Bakım / Onarım Görevi  (Bölüm ve Atölye Şefleri )","TTKB 25.06.2012 ve 69 sayılı İlköğretim Kurumları (İlkokul ve Ortaokul) Haftalık Ders Çizelgesi 7. Maddesi Gereği Sosyal, Kültürel, Sanatsal ve Sportif Faaliyetler Ücret Saati","Haftalık Ücretli\nDers Saati Toplamı","Haftalık  Nöbet Ücreti  Toplam Saati","Özel Eğitim Sınıf  Ücretli  Ders saati Toplamı","Haftalık Ücretli Yüksek Lisans Ücretli\nDers Saati Toplamı (%5)","Haftalık Ücretli Doktora Ücretli\nDers Saati Toplamı (%15)","Ücretli Dersin Saat \nBaşı Bürüt Ücreti","Ücretli Dersin ToplamBürüt Ücreti","Haftalık  Nöbet  Bürüt Üçreti ","Özel Eğitim  Sınıfı Ücretli Ders SaatiToplam Bürüt Ücreti (%25Fazlası)","Özel Eğitim  Sınıfı Ücretli Ders Saati Başı Bürüt Ücreti (%25Fazlası)","Yüksek Lisans Ücretli Dersin Saat \nBaşı Bürüt Ücreti (%5)","Yüksek Lisans Ücretli Dersin Saat \nBaşı Bürüt Ücreti (%5 Fazlası) Toplam","Doktora Ücretli Dersin Saat \nBaşı Bürüt Ücreti (%15 Fazlası) ","Doktora Ücretli Dersin \nToplam Bürüt Ücreti (%15 Fazlası)","Haftalık Ödenecek\nÜcret Tutarı",{"$f":"CONCATENATE(\"Mali Yıl:\",\" \",ANASAYFA!B8,\"\n \",\"Ay:\",\" \",ANASAYFA!B9)","v":"Mali Yıl: 2020\n Ay: OCAK"},null,null,null,null,null,null,null,"İlçemiz"]
[null,null,null,null,null,"Maaş Karşılığı","Diğer Okullardaki Maaş Karşılığı","Maaş Karşılığı DYK Toplamı","Ücret Karşılığı DYK Toplamı","Okulundaki /Diğer okullardaki Ücret Karşılığı toplamı","Özel Eğitim Sınıfı  Ders Saati","Ders Dışı Hazırlık\n ve Planlama","Öğr.Sos. Kiş.Hz.","Toplam",null,null,null,null,null,null,null,null,null,null,null,null,null,null,null,null,null,null,null,null,null,"Açıklamalar",null,null,null,null,null,null,null,{"$f":"PROPER((ANASAYFA!B5))","v":"Uluborlu Mesleki Ve Teknik Anadolu Lisesi"}]
[null,null,1,2,3,4,5,6,7,8,9,10,11,12,13,14,15,16,17,18,19,20,21,22,23,24,25,26,27,28,29,30,31,32,33,34]
[null,{"$f":"IF(ISBLANK(C5),\"\",ROUNDUP(ROWS($B$5:B5)/1,0))","v":1},{"$f":"IF(AO5>0,veriler!C5,\"\")","v":"RUHİ İLHAN"},{"$f":"IF(C5>0,CONCATENATE(veriler!F5,\"(\",veriler!E5,\")\"),\"\")","v":"Müdür(Coğrafya)"},{"$f":"IF(C5>0,veriler!G5,\"\")","v":"Lisans"},{"$f":"IFERROR(IF(C5>0,IF(veriler!K5<veriler!AF5,veriler!K5,veriler!AF5)),\"\")","v":0},{"$f":"IFERROR(IF(C5>0,veriler!AG5,0),\"\")","v":0},{"$f":"IFERROR(IF(C5>0,veriler!AO5,0),\"\")","v":0},{"$f":"IFERROR(IF(C5>0,veriler!AL5,0),\"\")","v":0},{"$f":"IFERROR(IF(C5>0,IF(veriler!BI5>0,veriler!BI5,0)),0)","v":0},null,{"$f":"IF(C5>0,veriler!BF5,0)","v":""},{"$f":"IF(C5>0,veriler!BG5,0)","v":""},{"$f":"SUM(F5:M5)+X5+Y5","v":0},{"$f":"IF(C5>0,veriler!H5,0)","v":"9/A"},{"$f":"IF(C5>0,veriler!V5,0)","v":0},{"$f":"IF(C5>0,veriler!W5,0)","v":0},{"$f":"IF(C5>0,veriler!X5,0)","v":0},{"$f":"IF(C5>0,veriler!Y5,0)","v":0},null,{"$f":"IFERROR(SUM(J5:M5)+SUM(P5:T5),\"\")","v":0},{"$f":"IF(C5>0,veriler!Z5,0)","v":0},{"$f":"IF(C5>0,veriler!AA5,0)","v":0},{"$f":"IF(C5>0,IF(veriler!BJ5>0,veriler!BJ5,0))","v":0},{"$f":"IF(C5>0,IF(veriler!BK5>0,veriler!BK5,0))","v":0},{"$f":"ANASAYFA!$B$21","v":20.448540000000001},{"$f":"IFERROR(IF(U5>0,U5*Z5,0),\"\")","v":0},{"$f":"IFERROR(IF(V5>0,V5*Z5,0),\"\")","v":0},{"$f":"ANASAYFA!$B$25","v":25.560675},{"$f":"IF(W5>0,W5*AC5,0)","v":0},{"$f":"ANASAYFA!$B$26","v":21.470967000000002},{"$f":"IFERROR(IF(X5>0,X5*AE5,0),\"\")","v":0},{"$f":"ANASAYFA!$B$27","v":23.515821000000003},{"$f":"IFERROR(Y5*AG5,\"\")","v":0},{"$f":"SUM(AA5,AB5,AD5,AF5,AH5)","v":0},null,null,0,null,null,1,null,null,"ücretli ders okutan yönetici ve öğretmenlerin,durumu yukarıda çizelge halinde sunulmuştur. 439 sayılı Kanun ve MEB Yönetici ve Öğretmenlerin ders ve ek Ders saatlerine ilişkin esaslar doğrultusunda  okutulan ücretli derslerin, ek ders ücreti olarak ödenmesine müsadelerinize arz ederim"]
[null,{"$f":"IF(C6=\"\",,COUNTIF($B$5:B5,\">0\")+1)","v":2},{"$f":"IF(AO6>0,veriler!C6,\"\")","v":"A.AKİF KÖSE"},{"$f":"IF(C6>0,CONCATENATE(veriler!F6,\"(\",veriler!E6,\")\"),\"\")","v":"Müdür Baş Yard(Elekt-Elektr.)"},{"$f":"IF(C6>0,veriler!G6,\"\")","v":"Y.Lisans"},{"$f":"IFERROR(IF(C6>0,IF(veriler!K6<veriler!AF6,veriler!K6,veriler!AF6)),\"\")","v":0},{"$f":"IFERROR(IF(C6>0,veriler!AG6,0),\"\")","v":0},{"$f":"IFERROR(IF(C6>0,veriler!AO6,0),\"\")","v":0},{"$f":"IFERROR(IF(C6>0,veriler!AL6,0),\"\")","v":0},{"$f":"IFERROR(IF(C6>0,IF(veriler!BI6>0,veriler!BI6,0)),0)","v":0},null,{"$f":"IF(C6>0,veriler!BF6,0)","v":""},{"$f":"IF(C6>0,veriler!BG6,0)","v":""},{"$f":"SUM(F6:M6)+X6+Y6","v":0},{"$f":"IF(C6>0,veriler!H6,0)","v":"10/C-11/C"},{"$f":"IF(C6>0,veriler!V6,0)","v":0},{"$f":"IF(C6>0,veriler!W6,0)","v":0},{"$f":"IF(C6>0,veriler!X6,0)","v":0},{"$f":"IF(C6>0,veriler!Y6,0)","v":0},null,{"$f":"IFERROR(SUM(J6:M6)+SUM(P6:T6),\"\")","v":0},{"$f":"IF(C6>0,veriler!Z6,0)","v":0},{"$f":"IF(C6>0,veriler!AA6,0)","v":0},{"$f":"IF(C6>0,IF(veriler!BJ6>0,veriler!BJ6,0))","v":0},{"$f":"IF(C6>0,IF(veriler!BK6>0,veriler!BK6,0))","v":0},{"$f":"ANASAYFA!$B$21","v":20.448540000000001},{"$f":"IFERROR(IF(U6>0,U6*Z6,0),\"\")","v":0},{"$f":"IFERROR(IF(V6>0,V6*Z6,0),\"\")","v":0},{"$f":"ANASAYFA!$B$25","v":25.560675},{"$f":"IF(W6>0,W6*AC6,0)","v":0},{"$f":"ANASAYFA!$B$26","v":21.470967000000002},{"$f":"IFERROR(IF(X6>0,X6*AE6,0),\"\")","v":0},{"$f":"ANASAYFA!$B$27","v":23.515821000000003},{"$f":"IFERROR(Y6*AG6,\"\")","v":0},{"$f":"SUM(AA6,AB6,AD6,AF6,AH6)","v":0},null,null,0,null,null,1]
[null,{"$f":"IF(C7=\"\",,COUNTIF($B$5:B6,\">0\")+1)","v":3},{"$f":"IF(AO7>0,veriler!C7,\"\")","v":"ALİ OĞUR"},{"$f":"IF(C7>0,CONCATENATE(veriler!F7,\"(\",veriler!E7,\")\"),\"\")","v":"Müdür Yardımcısı(Bilgisayar)"},{"$f":"IF(C7>0,veriler!G7,\"\")","v":"Lisans"},{"$f":"IFERROR(IF(C7>0,IF(veriler!K7<veriler!AF7,veriler!K7,veriler!AF7)),\"\")","v":0},{"$f":"IFERROR(IF(C7>0,veriler!AG7,0),\"\")","v":0},{"$f":"IFERROR(IF(C7>0,veriler!AO7,0),\"\")","v":0},{"$f":"IFERROR(IF(C7>0,veriler!AL7,0),\"\")","v":0},{"$f":"IFERROR(IF(C7>0,IF(veriler!BI7>0,veriler!BI7,0)),0)","v":0},null,{"$f":"IF(C7>0,veriler!BF7,0)","v":""},{"$f":"IF(C7>0,veriler!BG7,0)","v":""},0,{"$f":"IF(C7>0,veriler!H7,0)","v":"11-C"},{"$f":"IF(C7>0,veriler!V7,0)","v":0},{"$f":"IF(C7>0,veriler!W7,0)","v":0},{"$f":"IF(C7>0,veriler!X7,0)","v":0},{"$f":"IF(C7>0,veriler!Y7,0)","v":0},null,0,{"$f":"IF(C7>0,veriler!Z7,0)","v":0},{"$f":"IF(C7>0,veriler!AA7,0)","v":0},{"$f":"IF(C7>0,IF(veriler!BJ7>0,veriler!BJ7,0))","v":0},{"$f":"IF(C7>0,IF(veriler!BK7>0,veriler!BK7,0))","v":0},{"$f":"ANASAYFA!$B$21","v":20.448540000000001},0,0,{"$f":"ANASAYFA!$B$25","v":25.560675},0,{"$f":"ANASAYFA!$B$26","v":21.470967000000002},0,{"$f":"ANASAYFA!$B$27","v":23.515821000000003},0,0,null,null,0,null,null,1]
[null,{"$f":"IF(C8=\"\",,COUNTIF($B$5:B7,\">0\")+1)","v":4},{"$f":"IF(AO8>0,veriler!C8,\"\")","v":"ZEKİ DERELİ"},{"$f":"IF(C8>0,CONCATENATE(veriler!F8,\"(\",veriler!E8,\")\"),\"\")","v":"Müdür Yardımcısı(Beden Eğitimi)"},{"$f":"IF(C8>0,veriler!G8,\"\")","v":"Lisans"},{"$f":"IFERROR(IF(C8>0,IF(veriler!K8<veriler!AF8,veriler!K8,veriler!AF8)),\"\")","v":0},{"$f":"IFERROR(IF(C8>0,veriler!AG8,0),\"\")","v":0},{"$f":"IFERROR(IF(C8>0,veriler!AO8,0),\"\")","v":0},{"$f":"IFERROR(IF(C8>0,veriler!AL8,0),\"\")","v":0},{"$f":"IFERROR(IF(C8>0,IF(veriler!BI8>0,veriler!BI8,0)),0)","v":0},null,{"$f":"IF(C8>0,veriler!BF8,0)","v":""},{"$f":"IF(C8>0,veriler!BG8,0)","v":""},0,{"$f":"IF(C8>0,veriler!H8,0)","v":"9/A-10/B-10/C-11/A-11/C"},{"$f":"IF(C8>0,veriler!V8,0)","v":0},{"$f":"IF(C8>0,veriler!W8,0)","v":0},{"$f":"IF(C8>0,veriler!X8,0)","v":0},{"$f":"IF(C8>0,veriler!Y8,0)","v":0},null,0,{"$f":"IF(C8>0,veriler!Z8,0)","v":0},{"$f":"IF(C8>0,veriler!AA8,0)","v":0},{"$f":"IF(C8>0,IF(veriler!BJ8>0,veriler!BJ8,0))","v":0},{"$f":"IF(C8>0,IF(veriler!BK8>0,veriler!BK8,0))","v":0},{"$f":"ANASAYFA!$B$21","v":20.448540000000001},0,0,{"$f":"ANASAYFA!$B$25","v":25.560675},0,{"$f":"ANASAYFA!$B$26","v":21.470967000000002},0,{"$f":"ANASAYFA!$B$27","v":23.515821000000003},0,0,null,null,0,null,null,1]
[null,{"$f":"IF(C9=\"\",,COUNTIF($B$5:B8,\">0\")+1)","v":5},{"$f":"IF(AO9>0,veriler!C9,\"\")","v":"MUAMMER KAYAKUŞ"},{"$f":"IF(C9>0,CONCATENATE(veriler!F9,\"(\",veriler!E9,\")\"),\"\")","v":"Atölye/Lab Şefi(Elekt-Elektr.)"},{"$f":"IF(C9>0,veriler!G9,\"\")","v":"Lisans"},{"$f":"IFERROR(IF(C9>0,IF(veriler!K9<veriler!AF9,veriler!K9,veriler!AF9)),\"\")","v":0},{"$f":"IFERROR(IF(C9>0,veriler!AG9,0),\"\")","v":0},{"$f":"IFERROR(IF(C9>0,veriler!AO9,0),\"\")","v":0},{"$f":"IFERROR(IF(C9>0,veriler!AL9,0),\"\")","v":0},{"$f":"IFERROR(IF(C9>0,IF(veriler!BI9>0,veriler!BI9,0)),0)","v":0},null,{"$f":"IF(C9>0,veriler!BF9,0)","v":""},{"$f":"IF(C9>0,veriler!BG9,0)","v":""},0,{"$f":"IF(C9>0,veriler!H9,0)","v":"10/C-11/C"},{"$f":"IF(C9>0,veriler!V9,0)","v":0},{"$f":"IF(C9>0,veriler!W9,0)","v":0},{"$f":"IF(C9>0,veriler!X9,0)","v":0},{"$f":"IF(C9>0,veriler!Y9,0)","v":0},null,{"$f":"IFERROR(SUM(J9:M9)+SUM(P9:T9),\"\")","v":0},{"$f":"IF(C9>0,veriler!Z9,0)","v":0},{"$f":"IF(C9>0,veriler!AA9,0)","v":0},{"$f":"IF(C9>0,IF(veriler!BJ9>0,veriler!BJ9,0))","v":0},{"$f":"IF(C9>0,IF(veriler!BK9>0,veriler!BK9,0))","v":0},{"$f":"ANASAYFA!$B$21","v":20.448540000000001},0,0,{"$f":"ANASAYFA!$B$25","v":25.560675},0,{"$f":"ANASAYFA!$B$26","v":21.470967000000002},0,{"$f":"ANASAYFA!$B$27","v":23.515821000000003},0,0,null,null,0,null,null,1]
[null,{"$f":"IF(C10=\"\",,COUNTIF($B$5:B9,\">0\")+1)","v":6},{"$f":"IF(AO10>0,veriler!C10,\"\")","v":"MEHMET GÜLAY"},{"$f":"IF(C10>0,CONCATENATE(veriler!F10,\"(\",veriler!E10,\")\"),\"\")","v":"Alan Şefi(Metal İşl. )"},{"$f":"IF(C10>0,veriler!G10,\"\")","v":"Lisans"},{"$f":"IFERROR(IF(C10>0,IF(veriler!K10<veriler!AF10,veriler!K10,veriler!AF10)),\"\")","v":0},{"$f":"IFERROR(IF(C10>0,veriler!AG10,0),\"\")","v":0},{"$f":"IFERROR(IF(C10>0,veriler!AO10,0),\"\")","v":0},{"$f":"IFERROR(IF(C10>0,veriler!AL10,0),\"\")","v":0},{"$f":"IFERROR(IF(C10>0,IF(veriler!BI10>0,veriler!BI10,0)),0)","v":0},null,{"$f":"IF(C10>0,veriler!BF10,0)","v":""},{"$f":"IF(C10>0,veriler!BG10,0)","v":""},0,{"$f":"IF(C10>0,veriler!H10,0)","v":"10/B-12/B"},{"$f":"IF(C10>0,veriler!V10,0)","v":0},{"$f":"IF(C10>0,veriler!W10,0)","v":0},{"$f":"IF(C10>0,veriler!X10,0)","v":0},{"$f":"IF(C10>0,veriler!Y10,0)","v":0},null,0,{"$f":"IF(C10>0,veriler!Z10,0)","v":0},{"$f":"IF(C10>0,veriler!AA10,0)","v":0},{"$f":"IF(C10>0,IF(veriler!BJ10>0,veriler!BJ10,0))","v":0},{"$f":"IF(C10>0,IF(veriler!BK10>0,veriler!BK10,0))","v":0},{"$f":"ANASAYFA!$B$21","v":20.448540000000001},0,0,{"$f":"ANASAYFA!$B$25","v":25.560675},0,{"$f":"ANASAYFA!$B$26","v":21.470967000000002},0,{"$f":"ANASAYFA!$B$27","v":23.515821000000003},0,0,null,null,0,null,null,1]
[null,{"$f":"IF(C11=\"\",,COUNTIF($B$5:B10,\">0\")+1)","v":7},{"$f":"IF(AO11>0,veriler!C11,\"\")","v":"DEMET KAYA"},{"$f":"IF(C11>0,CONCATENATE(veriler!F11,\"(\",veriler!E11,\")\"),\"\")","v":"Öğretmen(Matematik)"},{"$f":"IF(C11>0,veriler!G11,\"\")","v":"Y.Lisans"},{"$f":"IFERROR(IF(C11>0,IF(veriler!K11<veriler!AF11,veriler!K11,veriler!AF11)),\"\")","v":0},{"$f":"IFERROR(IF(C11>0,veriler!AG11,0),\"\")","v":0},{"$f":"IFERROR(IF(C11>0,veriler!AO11,0),\"\")","v":0},{"$f":"IFERROR(IF(C11>0,veriler!AL11,0),\"\")","v":0},{"$f":"IFERROR(IF(C11>0,IF(veriler!BI11>0,veriler!BI11,0)),0)","v":0},null,{"$f":"IF(C11>0,veriler!BF11,0)","v":""},{"$f":"IF(C11>0,veriler!BG11,0)","v":0},0,{"$f":"IF(C11>0,veriler!H11,0)","v":"9/A-10/B-10/C-11/A-12/A-12/B"},{"$f":"IF(C11>0,veriler!V11,0)","v":0},{"$f":"IF(C11>0,veriler!W11,0)","v":0},{"$f":"IF(C11>0,veriler!X11,0)","v":0},{"$f":"IF(C11>0,veriler!Y11,0)","v":0},null,{"$f":"IFERROR(SUM(J11:M11)+SUM(P11:T11),\"\")","v":0},{"$f":"IF(C11>0,veriler!Z11,0)","v":0},{"$f":"IF(C11>0,veriler!AA11,0)","v":0},{"$f":"IF(C11>0,IF(veriler!BJ11>0,veriler!BJ11,0))","v":0},{"$f":"IF(C11>0,IF(veriler!BK11>0,veriler!BK11,0))","v":0},{"$f":"ANASAYFA!$B$21","v":20.448540000000001},0,0,{"$f":"ANASAYFA!$B$25","v":25.560675},0,{"$f":"ANASAYFA!$B$26","v":21.470967000000002},0,{"$f":"ANASAYFA!$B$27","v":23.515821000000003},0,0,null,null,0,null,null,1]
[null,{"$f":"IF(C12=\"\",,COUNTIF($B$5:B11,\">0\")+1)","v":8},{"$f":"IF(AO12>0,veriler!C12,\"\")","v":"ALİ ÇINAR"},{"$f":"IF(C12>0,CONCATENATE(veriler!F12,\"(\",veriler!E12,\")\"),\"\")","v":"Öğretmen(Fizik)"},{"$f":"IF(C12>0,veriler!G12,\"\")","v":"Lisans"},{"$f":"IFERROR(IF(C12>0,IF(veriler!K12<veriler!AF12,veriler!K12,veriler!AF12)),\"\")","v":0},{"$f":"IFERROR(IF(C12>0,veriler!AG12,0),\"\")","v":0},{"$f":"IFERROR(IF(C12>0,veriler!AO12,0),\"\")","v":0},{"$f":"IFERROR(IF(C12>0,veriler!AL12,0),\"\")","v":0},{"$f":"IFERROR(IF(C12>0,IF(veriler!BI12>0,veriler!BI12,0)),0)","v":0},null,{"$f":"IF(C12>0,veriler!BF12,0)","v":""},{"$f":"IF(C12>0,veriler!BG12,0)","v":0},0,{"$f":"IF(C12>0,veriler!H12,0)","v":"Keçiborlu AİHL de görevli"},{"$f":"IF(C12>0,veriler!V12,0)","v":0},{"$f":"IF(C12>0,veriler!W12,0)","v":0},{"$f":"IF(C12>0,veriler!X12,0)","v":0},{"$f":"IF(C12>0,veriler!Y12,0)","v":0},null,0,{"$f":"IF(C12>0,veriler!Z12,0)","v":0},{"$f":"IF(C12>0,veriler!AA12,0)","v":0},{"$f":"IF(C12>0,IF(veriler!BJ12>0,veriler!BJ12,0))","v":0},{"$f":"IF(C12>0,IF(veriler!BK12>0,veriler!BK12,0))","v":0},{"$f":"ANASAYFA!$B$21","v":20.448540000000001},0,0,{"$f":"ANASAYFA!$B$25","v":25.560675},0,{"$f":"ANASAYFA!$B$26","v":21.470967000000002},0,{"$f":"ANASAYFA!$B$27","v":23.515821000000003},0,0,null,null,null,null,null,1]
[null,{"$f":"IF(C13=\"\",,COUNTIF($B$5:B12,\">0\")+1)","v":9},{"$f":"IF(AO13>0,veriler!C13,\"\")","v":"NEVİN AKYOL"},{"$f":"IF(C13>0,CONCATENATE(veriler!F13,\"(\",veriler!E13,\")\"),\"\")","v":"Öğretmen(Kimya)"},{"$f":"IF(C13>0,veriler!G13,\"\")","v":"Lisans"},{"$f":"IFERROR(IF(C13>0,IF(veriler!K13<veriler!AF13,veriler!K13,veriler!AF13)),\"\")","v":0},{"$f":"IFERROR(IF(C13>0,veriler!AG13,0),\"\")","v":0},{"$f":"IFERROR(IF(C13>0,veriler!AO13,0),\"\")","v":0},{"$f":"IFERROR(IF(C13>0,veriler!AL13,0),\"\")","v":0},{"$f":"IFERROR(IF(C13>0,IF(veriler!BI13>0,veriler!BI13,0)),0)","v":0},null,{"$f":"IF(C13>0,veriler!BF13,0)","v":""},{"$f":"IF(C13>0,veriler!BG13,0)","v":0},0,{"$f":"IF(C13>0,veriler!H13,0)","v":"9/A-10/B-10/C"},{"$f":"IF(C13>0,veriler!V13,0)","v":0},{"$f":"IF(C13>0,veriler!W13,0)","v":0},{"$f":"IF(C13>0,veriler!X13,0)","v":0},{"$f":"IF(C13>0,veriler!Y13,0)","v":0},null,0,{"$f":"IF(C13>0,veriler!Z13,0)","v":0},{"$f":"IF(C13>0,veriler!AA13,0)","v":0},{"$f":"IF(C13>0,IF(veriler!BJ13>0,veriler!BJ13,0))","v":0},{"$f":"IF(C13>0,IF(veriler!BK13>0,veriler!BK13,0))","v":0},{"$f":"ANASAYFA!$B$21","v":20.448540000000001},0,0,{"$f":"ANASAYFA!$B$25","v":25.560675},0,{"$f":"ANASAYFA!$B$26","v":21.470967000000002},0,{"$f":"ANASAYFA!$B$27","v":23.515821000000003},0,0,null,null,null,null,null,1]
[null,{"$f":"IF(C14=\"\",,COUNTIF($B$5:B13,\">0\")+1)","v":10},{"$f":"IF(AO14>0,veriler!C14,\"\")","v":"CENNET ÖZKAN"},{"$f":"IF(C14>0,CONCATENATE(veriler!F14,\"(\",veriler!E14,\")\"),\"\")","v":"Öğretmen(İngilizce)"},{"$f":"IF(C14>0,veriler!G14,\"\")","v":"Lisans"},{"$f":"IFERROR(IF(C14>0,IF(veriler!K14<veriler!AF14,veriler!K14,veriler!AF14)),\"\")","v":0},{"$f":"IFERROR(IF(C14>0,veriler!AG14,0),\"\")","v":0},{"$f":"IFERROR(IF(C14>0,veriler!AO14,0),\"\")","v":0},{"$f":"IFERROR(IF(C14>0,veriler!AL14,0),\"\")","v":0},{"$f":"IFERROR(IF(C14>0,IF(veriler!BI14>0,veriler!BI14,0)),0)","v":0},null,{"$f":"IF(C14>0,veriler!BF14,0)","v":""},{"$f":"IF(C14>0,veriler!BG14,0)","v":0},0,{"$f":"IF(C14>0,veriler!H14,0)","v":"9/A-10/B-10/C-11/A-11/C-12/A-12/B"},{"$f":"IF(C14>0,veriler!V14,0)","v":0},{"$f":"IF(C14>0,veriler!W14,0)","v":0},{"$f":"IF(C14>0,veriler!X14,0)","v":0},{"$f":"IF(C14>0,veriler!Y14,0)","v":0},null,0,{"$f":"IF(C14>0,veriler!Z14,0)","v":0},{"$f":"IF(C14>0,veriler!AA14,0)","v":0},{"$f":"IF(C14>0,IF(veriler!BJ14>0,veriler!BJ14,0))","v":0},{"$f":"IF(C14>0,IF(veriler!BK14>0,veriler!BK14,0))","v":0},{"$f":"ANASAYFA!$B$21","v":20.448540000000001},0,0,{"$f":"ANASAYFA!$B$25","v":25.560675},0,{"$f":"ANASAYFA!$B$26","v":21.470967000000002},0,{"$f":"ANASAYFA!$B$27","v":23.515821000000003},0,0,null,null,0,null,null,1]
[null,{"$f":"IF(C15=\"\",,COUNTIF($B$5:B14,\">0\")+1)","v":11},{"$f":"IF(AO15>0,veriler!C15,\"\")","v":"NACİYE ÇIN"},{"$f":"IF(C15>0,CONCATENATE(veriler!F15,\"(\",veriler!E15,\")\"),\"\")","v":"Öğretmen(Din Kültürü Ve Ahl.Bilgisi)"},{"$f":"IF(C15>0,veriler!G15,\"\")","v":"Lisans"},{"$f":"IFERROR(IF(C15>0,IF(veriler!K15<veriler!AF15,veriler!K15,veriler!AF15)),\"\")","v":0},{"$f":"IFERROR(IF(C15>0,veriler!AG15,0),\"\")","v":0},{"$f":"IFERROR(IF(C15>0,veriler!AO15,0),\"\")","v":0},{"$f":"IFERROR(IF(C15>0,veriler!AL15,0),\"\")","v":0},{"$f":"IFERROR(IF(C15>0,IF(veriler!BI15>0,veriler!BI15,0)),0)","v":0},null,{"$f":"IF(C15>0,veriler!BF15,0)","v":""},{"$f":"IF(C15>0,veriler!BG15,0)","v":0},0,{"$f":"IF(C15>0,veriler!H15,0)","v":"9/A-10/B-10/C-11/A-11/C-12/A-12/B"},{"$f":"IF(C15>0,veriler!V15,0)","v":0},{"$f":"IF(C15>0,veriler!W15,0)","v":0},{"$f":"IF(C15>0,veriler!X15,0)","v":0},{"$f":"IF(C15>0,veriler!Y15,0)","v":0},null,0,{"$f":"IF(C15>0,veriler!Z15,0)","v":0},{"$f":"IF(C15>0,veriler!AA15,0)","v":0},{"$f":"IF(C15>0,IF(veriler!BJ15>0,veriler!BJ15,0))","v":0},{"$f":"IF(C15>0,IF(veriler!BK15>0,veriler!BK15,0))","v":0},{"$f":"ANASAYFA!$B$21","v":20.448540000000001},0,0,{"$f":"ANASAYFA!$B$25","v":25.560675},0,{"$f":"ANASAYFA!$B$26","v":21.470967000000002},0,{"$f":"ANASAYFA!$B$27","v":23.515821000000003},0,0,null,null,0,null,null,1]
[null,{"$f":"IF(C16=\"\",,COUNTIF($B$5:B15,\">0\")+1)","v":12},{"$f":"IF(AO16>0,veriler!C16,\"\")","v":"KARDİYE KÖK"},{"$f":"IF(C16>0,CONCATENATE(veriler!F16,\"(\",veriler!E16,\")\"),\"\")","v":"Atelye Öğretmeni(Harita-Tapu-Kadastro)"},{"$f":"IF(C16>0,veriler!G16,\"\")","v":"Lisans"},{"$f":"IFERROR(IF(C16>0,IF(veriler!K16<veriler!AF16,veriler!K16,veriler!AF16)),\"\")","v":0},{"$f":"IFERROR(IF(C16>0,veriler!AG16,0),\"\")","v":0},{"$f":"IFERROR(IF(C16>0,veriler!AO16,0),\"\")","v":0},{"$f":"IFERROR(IF(C16>0,veriler!AL16,0),\"\")","v":0},{"$f":"IFERROR(IF(C16>0,IF(veriler!BI16>0,veriler!BI16,0)),0)","v":0},null,{"$f":"IF(C16>0,veriler!BF16,0)","v":""},{"$f":"IF(C16>0,veriler!BG16,0)","v":0},0,{"$f":"IF(C16>0,veriler!H16,0)","v":"11/A-12/A"},{"$f":"IF(C16>0,veriler!V16,0)","v":0},{"$f":"IF(C16>0,veriler!W16,0)","v":0},{"$f":"IF(C16>0,veriler!X16,0)","v":0},{"$f":"IF(C16>0,veriler!Y16,0)","v":0},null,0,{"$f":"IF(C16>0,veriler!Z16,0)","v":0},{"$f":"IF(C16>0,veriler!AA16,0)","v":0},{"$f":"IF(C16>0,IF(veriler!BJ16>0,veriler!BJ16,0))","v":0},{"$f":"IF(C16>0,IF(veriler!BK16>0,veriler!BK16,0))","v":0},{"$f":"ANASAYFA!$B$21","v":20.448540000000001},0,0,{"$f":"ANASAYFA!$B$25","v":25.560675},0,{"$f":"ANASAYFA!$B$26","v":21.470967000000002},0,{"$f":"ANASAYFA!$B$27","v":23.515821000000003},0,0,null,null,0,null,null,1]
[null,{"$f":"IF(C17=\"\",,COUNTIF($B$5:B16,\">0\")+1)","v":13},{"$f":"IF(AO17>0,veriler!C17,\"\")","v":"FİDAN ERBEYLİ"},{"$f":"IF(C17>0,CONCATENATE(veriler!F17,\"(\",veriler!E17,\")\"),\"\")","v":"Öğretmen(Türk Dili ve Edebiyatı)"},{"$f":"IF(C17>0,veriler!G17,\"\")","v":"Y.Lisans"},{"$f":"IFERROR(IF(C17>0,IF(veriler!K17<veriler!AF17,veriler!K17,veriler!AF17)),\"\")","v":0},{"$f":"IFERROR(IF(C17>0,veriler!AG17,0),\"\")","v":0},{"$f":"IFERROR(IF(C17>0,veriler!AO17,0),\"\")","v":0},{"$f":"IFERROR(IF(C17>0,veriler!AL17,0),\"\")","v":0},{"$f":"IFERROR(IF(C17>0,IF(veriler!BI17>0,veriler!BI17,0)),0)","v":0},null,{"$f":"IF(C17>0,veriler!BF17,0)","v":""},{"$f":"IF(C17>0,veriler!BG17,0)","v":0},0,{"$f":"IF(C17>0,veriler!H17,0)","v":"9/A-10/B-10/C-12/A-12/B"},{"$f":"IF(C17>0,veriler!V17,0)","v":0},{"$f":"IF(C17>0,veriler!W17,0)","v":0},{"$f":"IF(C17>0,veriler!X17,0)","v":0},{"$f":"IF(C17>0,veriler!Y17,0)","v":0},null,0,{"$f":"IF(C17>0,veriler!Z17,0)","v":0},{"$f":"IF(C17>0,veriler!AA17,0)","v":0},{"$f":"IF(C17>0,IF(veriler!BJ17>0,veriler!BJ17,0))","v":0},{"$f":"IF(C17>0,IF(veriler!BK17>0,veriler!BK17,0))","v":0},{"$f":"ANASAYFA!$B$21","v":20.448540000000001},0,0,{"$f":"ANASAYFA!$B$25","v":25.560675},0,{"$f":"ANASAYFA!$B$26","v":21.470967000000002},0,{"$f":"ANASAYFA!$B$27","v":23.515821000000003},0,0,null,null,0,null,null,1]
[null,{"$f":"IF(C18=\"\",,COUNTIF($B$5:B17,\">0\")+1)","v":14},{"$f":"IF(AO18>0,veriler!C18,\"\")","v":"HATİCE UYSAL"},{"$f":"IF(C18>0,CONCATENATE(veriler!F18,\"(\",veriler!E18,\")\"),\"\")","v":"Atelye Öğretmeni(Metal İşl. )"},{"$f":"IF(C18>0,veriler!G18,\"\")","v":"Lisans"},{"$f":"IFERROR(IF(C18>0,IF(veriler!K18<veriler!AF18,veriler!K18,veriler!AF18)),\"\")","v":0},{"$f":"IFERROR(IF(C18>0,veriler!AG18,0),\"\")","v":0},{"$f":"IFERROR(IF(C18>0,veriler!AO18,0),\"\")","v":0},{"$f":"IFERROR(IF(C18>0,veriler!AL18,0),\"\")","v":0},{"$f":"IFERROR(IF(C18>0,IF(veriler!BI18>0,veriler!BI18,0)),0)","v":0},null,{"$f":"IF(C18>0,veriler!BF18,0)","v":""},{"$f":"IF(C18>0,veriler!BG18,0)","v":0},0,{"$f":"IF(C18>0,veriler!H18,0)","v":"9/A-10/B-10/C-12B"},{"$f":"IF(C18>0,veriler!V18,0)","v":0},{"$f":"IF(C18>0,veriler!W18,0)","v":0},{"$f":"IF(C18>0,veriler!X18,0)","v":0},{"$f":"IF(C18>0,veriler!Y18,0)","v":0},null,0,{"$f":"IF(C18>0,veriler!Z18,0)","v":0},{"$f":"IF(C18>0,veriler!AA18,0)","v":0},{"$f":"IF(C18>0,IF(veriler!BJ18>0,veriler!BJ18,0))","v":0},{"$f":"IF(C18>0,IF(veriler!BK18>0,veriler!BK18,0))","v":0},{"$f":"ANASAYFA!$B$21","v":20.448540000000001},0,0,{"$f":"ANASAYFA!$B$25","v":25.560675},0,{"$f":"ANASAYFA!$B$26","v":21.470967000000002},0,{"$f":"ANASAYFA!$B$27","v":23.515821000000003},0,0,null,null,0,null,null,1]
[null,{"$f":"IF(C19=\"\",,COUNTIF($B$5:B18,\">0\")+1)","v":15},{"$f":"IF(AO19>0,veriler!C19,\"\")","v":"ÜMMÜ NUR ŞEN"},{"$f":"IF(C19>0,CONCATENATE(veriler!F19,\"(\",veriler!E19,\")\"),\"\")","v":"Ücretli Öğretmen(Fizik)"},{"$f":"IF(C19>0,veriler!G19,\"\")","v":"Lisans"},{"$f":"IFERROR(IF(C19>0,IF(veriler!K19<veriler!AF19,veriler!K19,veriler!AF19)),\"\")","v":0},{"$f":"IFERROR(IF(C19>0,veriler!AG19,0),\"\")","v":0},{"$f":"IFERROR(IF(C19>0,veriler!AO19,0),\"\")","v":0},{"$f":"IFERROR(IF(C19>0,veriler!AL19,0),\"\")","v":0},{"$f":"IFERROR(IF(C19>0,IF(veriler!BI19>0,veriler!BI19,0)),0)","v":0},null,{"$f":"IF(C19>0,veriler!BF19,0)","v":""},{"$f":"IF(C19>0,veriler!BG19,0)","v":""},0,{"$f":"IF(C19>0,veriler!H19,0)","v":"9/A-10/B-10C"},{"$f":"IF(C19>0,veriler!V19,0)","v":0},{"$f":"IF(C19>0,veriler!W19,0)","v":0},{"$f":"IF(C19>0,veriler!X19,0)","v":0},{"$f":"IF(C19>0,veriler!Y19,0)","v":0},null,0,{"$f":"IF(C19>0,veriler!Z19,0)","v":0},{"$f":"IF(C19>0,veriler!AA19,0)","v":0},{"$f":"IF(C19>0,IF(veriler!BJ19>0,veriler!BJ19,0))","v":0},{"$f":"IF(C19>0,IF(veriler!BK19>0,veriler!BK19,0))","v":0},{"$f":"ANASAYFA!$B$21","v":20.448540000000001},0,0,{"$f":"ANASAYFA!$B$25","v":25.560675},0,{"$f":"ANASAYFA!$B$26","v":21.470967000000002},0,{"$f":"ANASAYFA!$B$27","v":23.515821000000003},0,0,null,null,0,null,null,1]
[null,{"$f":"IF(C20=\"\",,COUNTIF($B$5:B19,\">0\")+1)","v":0},{"$f":"IF(AO20>0,veriler!C20,\"\")","v":""},{"$f":"IF(C20>0,CONCATENATE(veriler!F20,\"(\",veriler!E20,\")\"),\"\")","v":"Sınıf Öğretmeni(Beden Eğitimi)"},{"$f":"IF(C20>0,veriler!G20,\"\")","v":"Lisans"},{"$f":"IFERROR(IF(C20>0,IF(veriler!K20<veriler!AF20,veriler!K20,veriler!AF20)),\"\")","v":0},{"$f":"IFERROR(IF(C20>0,veriler!AG20,0),\"\")","v":0},{"$f":"IFERROR(IF(C20>0,veriler!AO20,0),\"\")","v":0},{"$f":"IFERROR(IF(C20>0,veriler!AL20,0),\"\")","v":0},{"$f":"IFERROR(IF(C20>0,IF(veriler!BI20>0,veriler!BI20,0)),0)","v":0},null,{"$f":"IF(C20>0,veriler!BF20,0)","v":""},{"$f":"IF(C20>0,veriler!BG20,0)","v":0},0,{"$f":"IF(C20>0,veriler!H20,0)","v":0},{"$f":"IF(C20>0,veriler!V20,0)","v":0},{"$f":"IF(C20>0,veriler!W20,0)","v":0},{"$f":"IF(C20>0,veriler!X20,0)","v":0},{"$f":"IF(C20>0,veriler!Y20,0)","v":0},null,0,{"$f":"IF(C20>0,veriler!Z20,0)","v":0},{"$f":"IF(C20>0,veriler!AA20,0)","v":0},{"$f":"IF(C20>0,IF(veriler!BJ20>0,veriler!BJ20,0))","v":0},{"$f":"IF(C20>0,IF(veriler!BK20>0,veriler!BK20,0))","v":0},{"$f":"ANASAYFA!$B$21","v":20.448540000000001},0,0,{"$f":"ANASAYFA!$B$25","v":25.560675},0,{"$f":"ANASAYFA!$B$26","v":21.470967000000002},0,{"$f":"ANASAYFA!$B$27","v":23.515821000000003},0,0,null,null,0]
[null,{"$f":"IF(C21=\"\",,COUNTIF($B$5:B20,\">0\")+1)","v":0},{"$f":"IF(AO21>0,veriler!C21,\"\")","v":""},{"$f":"IF(C21>0,CONCATENATE(veriler!F21,\"(\",veriler!E21,\")\"),\"\")","v":"()"},{"$f":"IF(C21>0,veriler!G21,\"\")","v":0},{"$f":"IFERROR(IF(C21>0,IF(veriler!K21<veriler!AF21,veriler!K21,veriler!AF21)),\"\")","v":""},{"$f":"IFERROR(IF(C21>0,veriler!AG21,0),\"\")","v":""},{"$f":"IFERROR(IF(C21>0,veriler!AO21,0),\"\")","v":0},{"$f":"IFERROR(IF(C21>0,veriler!AL21,0),\"\")","v":0},{"$f":"IFERROR(IF(C21>0,IF(veriler!BI21>0,veriler!BI21,0)),0)","v":0},null,{"$f":"IF(C21>0,veriler!BF21,0)","v":""},{"$f":"IF(C21>0,veriler!BG21,0)","v":""},0,{"$f":"IF(C21>0,veriler!H21,0)","v":0},{"$f":"IF(C21>0,veriler!V21,0)","v":0},{"$f":"IF(C21>0,veriler!W21,0)","v":0},{"$f":"IF(C21>0,veriler!X21,0)","v":0},{"$f":"IF(C21>0,veriler!Y21,0)","v":0},null,0,{"$f":"IF(C21>0,veriler!Z21,0)","v":0},{"$f":"IF(C21>0,veriler!AA21,0)","v":0},{"$f":"IF(C21>0,IF(veriler!BJ21>0,veriler!BJ21,0))","v":0},{"$f":"IF(C21>0,IF(veriler!BK21>0,veriler!BK21,0))","v":0},{"$f":"ANASAYFA!$B$21","v":20.448540000000001},0,0,{"$f":"ANASAYFA!$B$25","v":25.560675},0,{"$f":"ANASAYFA!$B$26","v":21.470967000000002},0,{"$f":"ANASAYFA!$B$27","v":23.515821000000003},0,0,null,null,{"$error":"#VALUE!"}]
[null,{"$f":"IF(C22=\"\",,COUNTIF($B$5:B21,\">0\")+1)","v":0},{"$f":"IF(AO22>0,veriler!C22,\"\")","v":""},{"$f":"IF(C22>0,CONCATENATE(veriler!F22,\"(\",veriler!E22,\")\"),\"\")","v":"()"},{"$f":"IF(C22>0,veriler!G22,\"\")","v":0},{"$f":"IFERROR(IF(C22>0,IF(veriler!K22<veriler!AF22,veriler!K22,veriler!AF22)),\"\")","v":""},{"$f":"IFERROR(IF(C22>0,veriler!AG22,0),\"\")","v":""},{"$f":"IFERROR(IF(C22>0,veriler!AO22,0),\"\")","v":0},{"$f":"IFERROR(IF(C22>0,veriler!AL22,0),\"\")","v":0},{"$f":"IFERROR(IF(C22>0,IF(veriler!BI22>0,veriler!BI22,0)),0)","v":0},null,{"$f":"IF(C22>0,veriler!BF22,0)","v":""},{"$f":"IF(C22>0,veriler!BG22,0)","v":""},0,{"$f":"IF(C22>0,veriler!H22,0)","v":0},{"$f":"IF(C22>0,veriler!V22,0)","v":0},{"$f":"IF(C22>0,veriler!W22,0)","v":0},{"$f":"IF(C22>0,veriler!X22,0)","v":0},{"$f":"IF(C22>0,veriler!Y22,0)","v":0},null,0,{"$f":"IF(C22>0,veriler!Z22,0)","v":0},{"$f":"IF(C22>0,veriler!AA22,0)","v":0},{"$f":"IF(C22>0,IF(veriler!BJ22>0,veriler!BJ22,0))","v":0},{"$f":"IF(C22>0,IF(veriler!BK22>0,veriler!BK22,0))","v":0},{"$f":"ANASAYFA!$B$21","v":20.448540000000001},0,0,{"$f":"ANASAYFA!$B$25","v":25.560675},0,{"$f":"ANASAYFA!$B$26","v":21.470967000000002},0,{"$f":"ANASAYFA!$B$27","v":23.515821000000003},0,0,null,null,{"$error":"#VALUE!"}]
[null,{"$f":"IF(C23=\"\",,COUNTIF($B$5:B22,\">0\")+1)","v":0},{"$f":"IF(AO23>0,veriler!C23,\"\")","v":""},{"$f":"IF(C23>0,CONCATENATE(veriler!F23,\"(\",veriler!E23,\")\"),\"\")","v":"()"},{"$f":"IF(C23>0,veriler!G23,\"\")","v":0},{"$f":"IFERROR(IF(C23>0,IF(veriler!K23<veriler!AF23,veriler!K23,veriler!AF23)),\"\")","v":""},{"$f":"IFERROR(IF(C23>0,veriler!AG23,0),\"\")","v":""},{"$f":"IFERROR(IF(C23>0,veriler!AO23,0),\"\")","v":0},{"$f":"IFERROR(IF(C23>0,veriler!AL23,0),\"\")","v":0},{"$f":"IFERROR(IF(C23>0,IF(veriler!BI23>0,veriler!BI23,0)),0)","v":0},null,{"$f":"IF(C23>0,veriler!BF23,0)","v":""},{"$f":"IF(C23>0,veriler!BG23,0)","v":""},0,{"$f":"IF(C23>0,veriler!H23,0)","v":0},{"$f":"IF(C23>0,veriler!V23,0)","v":0},{"$f":"IF(C23>0,veriler!W23,0)","v":0},{"$f":"IF(C23>0,veriler!X23,0)","v":0},{"$f":"IF(C23>0,veriler!Y23,0)","v":0},null,0,{"$f":"IF(C23>0,veriler!Z23,0)","v":0},{"$f":"IF(C23>0,veriler!AA23,0)","v":0},{"$f":"IF(C23>0,IF(veriler!BJ23>0,veriler!BJ23,0))","v":0},{"$f":"IF(C23>0,IF(veriler!BK23>0,veriler!BK23,0))","v":0},{"$f":"ANASAYFA!$B$21","v":20.448540000000001},0,0,{"$f":"ANASAYFA!$B$25","v":25.560675},0,{"$f":"ANASAYFA!$B$26","v":21.470967000000002},0,{"$f":"ANASAYFA!$B$27","v":23.515821000000003},0,0,null,null,{"$error":"#VALUE!"}]
[null,{"$f":"IF(C24=\"\",,COUNTIF($B$5:B23,\">0\")+1)","v":0},{"$f":"IF(AO24>0,veriler!C24,\"\")","v":""},{"$f":"IF(C24>0,CONCATENATE(veriler!F24,\"(\",veriler!E24,\")\"),\"\")","v":"()"},{"$f":"IF(C24>0,veriler!G24,\"\")","v":0},{"$f":"IFERROR(IF(C24>0,IF(veriler!K24<veriler!AF24,veriler!K24,veriler!AF24)),\"\")","v":""},{"$f":"IFERROR(IF(C24>0,veriler!AG24,0),\"\")","v":""},{"$f":"IFERROR(IF(C24>0,veriler!AO24,0),\"\")","v":0},{"$f":"IFERROR(IF(C24>0,veriler!AL24,0),\"\")","v":0},{"$f":"IFERROR(IF(C24>0,IF(veriler!BI24>0,veriler!BI24,0)),0)","v":0},null,{"$f":"IF(C24>0,veriler!BF24,0)","v":""},{"$f":"IF(C24>0,veriler!BG24,0)","v":""},0,{"$f":"IF(C24>0,veriler!H24,0)","v":0},{"$f":"IF(C24>0,veriler!V24,0)","v":0},{"$f":"IF(C24>0,veriler!W24,0)","v":0},{"$f":"IF(C24>0,veriler!X24,0)","v":0},{"$f":"IF(C24>0,veriler!Y24,0)","v":0},null,0,{"$f":"IF(C24>0,veriler!Z24,0)","v":0},{"$f":"IF(C24>0,veriler!AA24,0)","v":0},{"$f":"IF(C24>0,IF(veriler!BJ24>0,veriler!BJ24,0))","v":0},{"$f":"IF(C24>0,IF(veriler!BK24>0,veriler!BK24,0))","v":0},{"$f":"ANASAYFA!$B$21","v":20.448540000000001},0,0,{"$f":"ANASAYFA!$B$25","v":25.560675},0,{"$f":"ANASAYFA!$B$26","v":21.470967000000002},0,{"$f":"ANASAYFA!$B$27","v":23.515821000000003},0,0,null,null,{"$error":"#VALUE!"}]
[null,{"$f":"IF(C25=\"\",,COUNTIF($B$5:B24,\">0\")+1)","v":0},{"$f":"IF(AO25>0,veriler!C25,\"\")","v":""},{"$f":"IF(C25>0,CONCATENATE(veriler!F25,\"(\",veriler!E25,\")\"),\"\")","v":"()"},{"$f":"IF(C25>0,veriler!G25,\"\")","v":0},{"$f":"IFERROR(IF(C25>0,IF(veriler!K25<veriler!AF25,veriler!K25,veriler!AF25)),\"\")","v":""},{"$f":"IFERROR(IF(C25>0,veriler!AG25,0),\"\")","v":""},{"$f":"IFERROR(IF(C25>0,veriler!AO25,0),\"\")","v":0},{"$f":"IFERROR(IF(C25>0,veriler!AL25,0),\"\")","v":0},{"$f":"IFERROR(IF(C25>0,IF(veriler!BI25>0,veriler!BI25,0)),0)","v":0},null,{"$f":"IF(C25>0,veriler!BF25,0)","v":""},{"$f":"IF(C25>0,veriler!BG25,0)","v":""},0,{"$f":"IF(C25>0,veriler!H25,0)","v":0},{"$f":"IF(C25>0,veriler!V25,0)","v":0},{"$f":"IF(C25>0,veriler!W25,0)","v":0},{"$f":"IF(C25>0,veriler!X25,0)","v":0},{"$f":"IF(C25>0,veriler!Y25,0)","v":0},null,0,{"$f":"IF(C25>0,veriler!Z25,0)","v":0},{"$f":"IF(C25>0,veriler!AA25,0)","v":0},{"$f":"IF(C25>0,IF(veriler!BJ25>0,veriler!BJ25,0))","v":0},{"$f":"IF(C25>0,IF(veriler!BK25>0,veriler!BK25,0))","v":0},{"$f":"ANASAYFA!$B$21","v":20.448540000000001},0,0,{"$f":"ANASAYFA!$B$25","v":25.560675},0,{"$f":"ANASAYFA!$B$26","v":21.470967000000002},0,{"$f":"ANASAYFA!$B$27","v":23.515821000000003},0,0,null,null,{"$error":"#VALUE!"}]
[null,{"$f":"IF(C26=\"\",,COUNTIF($B$5:B25,\">0\")+1)","v":0},{"$f":"IF(AO26>0,veriler!C26,\"\")","v":""},{"$f":"IF(C26>0,CONCATENATE(veriler!F26,\"(\",veriler!E26,\")\"),\"\")","v":"()"},{"$f":"IF(C26>0,veriler!G26,\"\")","v":0},{"$f":"IFERROR(IF(C26>0,IF(veriler!K26<veriler!AF26,veriler!K26,veriler!AF26)),\"\")","v":""},{"$f":"IFERROR(IF(C26>0,veriler!AG26,0),\"\")","v":""},{"$f":"IFERROR(IF(C26>0,veriler!AO26,0),\"\")","v":0},{"$f":"IFERROR(IF(C26>0,veriler!AL26,0),\"\")","v":0},{"$f":"IFERROR(IF(C26>0,IF(veriler!BI26>0,veriler!BI26,0)),0)","v":0},null,{"$f":"IF(C26>0,veriler!BF26,0)","v":""},{"$f":"IF(C26>0,veriler!BG26,0)","v":""},0,{"$f":"IF(C26>0,veriler!H26,0)","v":0},{"$f":"IF(C26>0,veriler!V26,0)","v":0},{"$f":"IF(C26>0,veriler!W26,0)","v":0},{"$f":"IF(C26>0,veriler!X26,0)","v":0},{"$f":"IF(C26>0,veriler!Y26,0)","v":0},null,0,{"$f":"IF(C26>0,veriler!Z26,0)","v":0},{"$f":"IF(C26>0,veriler!AA26,0)","v":0},{"$f":"IF(C26>0,IF(veriler!BJ26>0,veriler!BJ26,0))","v":0},{"$f":"IF(C26>0,IF(veriler!BK26>0,veriler!BK26,0))","v":0},{"$f":"ANASAYFA!$B$21","v":20.448540000000001},0,0,{"$f":"ANASAYFA!$B$25","v":25.560675},0,{"$f":"ANASAYFA!$B$26","v":21.470967000000002},0,{"$f":"ANASAYFA!$B$27","v":23.515821000000003},0,0,null,null,{"$error":"#VALUE!"}]
[null,{"$f":"IF(C27=\"\",,COUNTIF($B$5:B26,\">0\")+1)","v":0},{"$f":"IF(AO27>0,veriler!C27,\"\")","v":""},{"$f":"IF(C27>0,CONCATENATE(veriler!F27,\"(\",veriler!E27,\")\"),\"\")","v":"()"},{"$f":"IF(C27>0,veriler!G27,\"\")","v":0},{"$f":"IFERROR(IF(C27>0,IF(veriler!K27<veriler!AF27,veriler!K27,veriler!AF27)),\"\")","v":""},{"$f":"IFERROR(IF(C27>0,veriler!AG27,0),\"\")","v":""},{"$f":"IFERROR(IF(C27>0,veriler!AO27,0),\"\")","v":0},{"$f":"IFERROR(IF(C27>0,veriler!AL27,0),\"\")","v":0},{"$f":"IFERROR(IF(C27>0,IF(veriler!BI27>0,veriler!BI27,0)),0)","v":0},null,{"$f":"IF(C27>0,veriler!BF27,0)","v":""},{"$f":"IF(C27>0,veriler!BG27,0)","v":""},0,{"$f":"IF(C27>0,veriler!H27,0)","v":0},{"$f":"IF(C27>0,veriler!V27,0)","v":0},{"$f":"IF(C27>0,veriler!W27,0)","v":0},{"$f":"IF(C27>0,veriler!X27,0)","v":0},{"$f":"IF(C27>0,veriler!Y27,0)","v":0},null,0,{"$f":"IF(C27>0,veriler!Z27,0)","v":0},{"$f":"IF(C27>0,veriler!AA27,0)","v":0},{"$f":"IF(C27>0,IF(veriler!BJ27>0,veriler!BJ27,0))","v":0},{"$f":"IF(C27>0,IF(veriler!BK27>0,veriler!BK27,0))","v":0},{"$f":"ANASAYFA!$B$21","v":20.448540000000001},0,0,{"$f":"ANASAYFA!$B$25","v":25.560675},0,{"$f":"ANASAYFA!$B$26","v":21.470967000000002},0,{"$f":"ANASAYFA!$B$27","v":23.515821000000003},0,0,null,null,{"$error":"#VALUE!"}]
[null,{"$f":"IF(C28=\"\",,COUNTIF($B$5:B27,\">0\")+1)","v":0},{"$f":"IF(AO28>0,veriler!C28,\"\")","v":""},{"$f":"IF(C28>0,CONCATENATE(veriler!F28,\"(\",veriler!E28,\")\"),\"\")","v":"()"},{"$f":"IF(C28>0,veriler!G28,\"\")","v":0},{"$f":"IFERROR(IF(C28>0,IF(veriler!K28<veriler!AF28,veriler!K28,veriler!AF28)),\"\")","v":""},{"$f":"IFERROR(IF(C28>0,veriler!AG28,0),\"\")","v":""},{"$f":"IFERROR(IF(C28>0,veriler!AO28,0),\"\")","v":0},{"$f":"IFERROR(IF(C28>0,veriler!AL28,0),\"\")","v":0},{"$f":"IFERROR(IF(C28>0,IF(veriler!BI28>0,veriler!BI28,0)),0)","v":0},null,{"$f":"IF(C28>0,veriler!BF28,0)","v":""},{"$f":"IF(C28>0,veriler!BG28,0)","v":""},0,{"$f":"IF(C28>0,veriler!H28,0)","v":0},{"$f":"IF(C28>0,veriler!V28,0)","v":0},{"$f":"IF(C28>0,veriler!W28,0)","v":0},{"$f":"IF(C28>0,veriler!X28,0)","v":0},{"$f":"IF(C28>0,veriler!Y28,0)","v":0},null,0,{"$f":"IF(C28>0,veriler!Z28,0)","v":0},{"$f":"IF(C28>0,veriler!AA28,0)","v":0},{"$f":"IF(C28>0,IF(veriler!BJ28>0,veriler!BJ28,0))","v":0},{"$f":"IF(C28>0,IF(veriler!BK28>0,veriler!BK28,0))","v":0},{"$f":"ANASAYFA!$B$21","v":20.448540000000001},0,0,{"$f":"ANASAYFA!$B$25","v":25.560675},0,{"$f":"ANASAYFA!$B$26","v":21.470967000000002},0,{"$f":"ANASAYFA!$B$27","v":23.515821000000003},0,0,null,null,{"$error":"#VALUE!"}]
[null,{"$f":"IF(C29=\"\",,COUNTIF($B$5:B28,\">0\")+1)","v":0},{"$f":"IF(AO29>0,veriler!C29,\"\")","v":""},{"$f":"IF(C29>0,CONCATENATE(veriler!F29,\"(\",veriler!E29,\")\"),\"\")","v":"()"},{"$f":"IF(C29>0,veriler!G29,\"\")","v":0},{"$f":"IFERROR(IF(C29>0,IF(veriler!K29<veriler!AF29,veriler!K29,veriler!AF29)),\"\")","v":""},{"$f":"IFERROR(IF(C29>0,veriler!AG29,0),\"\")","v":""},{"$f":"IFERROR(IF(C29>0,veriler!AO29,0),\"\")","v":0},{"$f":"IFERROR(IF(C29>0,veriler!AL29,0),\"\")","v":0},{"$f":"IFERROR(IF(C29>0,IF(veriler!BI29>0,veriler!BI29,0)),0)","v":0},null,{"$f":"IF(C29>0,veriler!BF29,0)","v":""},{"$f":"IF(C29>0,veriler!BG29,0)","v":""},0,{"$f":"IF(C29>0,veriler!H29,0)","v":0},{"$f":"IF(C29>0,veriler!V29,0)","v":0},{"$f":"IF(C29>0,veriler!W29,0)","v":0},{"$f":"IF(C29>0,veriler!X29,0)","v":0},{"$f":"IF(C29>0,veriler!Y29,0)","v":0},null,0,{"$f":"IF(C29>0,veriler!Z29,0)","v":0},{"$f":"IF(C29>0,veriler!AA29,0)","v":0},{"$f":"IF(C29>0,IF(veriler!BJ29>0,veriler!BJ29,0))","v":0},{"$f":"IF(C29>0,IF(veriler!BK29>0,veriler!BK29,0))","v":0},{"$f":"ANASAYFA!$B$21","v":20.448540000000001},0,0,{"$f":"ANASAYFA!$B$25","v":25.560675},0,{"$f":"ANASAYFA!$B$26","v":21.470967000000002},0,{"$f":"ANASAYFA!$B$27","v":23.515821000000003},0,0,null,null,{"$error":"#VALUE!"}]
[null,{"$f":"IF(C30=\"\",,COUNTIF($B$5:B29,\">0\")+1)","v":0},{"$f":"IF(AO30>0,veriler!C30,\"\")","v":""},{"$f":"IF(C30>0,CONCATENATE(veriler!F30,\"(\",veriler!E30,\")\"),\"\")","v":"()"},{"$f":"IF(C30>0,veriler!G30,\"\")","v":0},{"$f":"IFERROR(IF(C30>0,IF(veriler!K30<veriler!AF30,veriler!K30,veriler!AF30)),\"\")","v":""},{"$f":"IFERROR(IF(C30>0,veriler!AG30,0),\"\")","v":""},{"$f":"IFERROR(IF(C30>0,veriler!AO30,0),\"\")","v":0},{"$f":"IFERROR(IF(C30>0,veriler!AL30,0),\"\")","v":0},{"$f":"IFERROR(IF(C30>0,IF(veriler!BI30>0,veriler!BI30,0)),0)","v":0},null,{"$f":"IF(C30>0,veriler!BF30,0)","v":""},{"$f":"IF(C30>0,veriler!BG30,0)","v":""},0,{"$f":"IF(C30>0,veriler!H30,0)","v":0},{"$f":"IF(C30>0,veriler!V30,0)","v":0},{"$f":"IF(C30>0,veriler!W30,0)","v":0},{"$f":"IF(C30>0,veriler!X30,0)","v":0},{"$f":"IF(C30>0,veriler!Y30,0)","v":0},null,0,{"$f":"IF(C30>0,veriler!Z30,0)","v":0},{"$f":"IF(C30>0,veriler!AA30,0)","v":0},{"$f":"IF(C30>0,IF(veriler!BJ30>0,veriler!BJ30,0))","v":0},{"$f":"IF(C30>0,IF(veriler!BK30>0,veriler!BK30,0))","v":0},{"$f":"ANASAYFA!$B$21","v":20.448540000000001},0,0,{"$f":"ANASAYFA!$B$25","v":25.560675},0,{"$f":"ANASAYFA!$B$26","v":21.470967000000002},0,{"$f":"ANASAYFA!$B$27","v":23.515821000000003},0,0,null,null,{"$error":"#VALUE!"}]
[null,{"$f":"IF(C31=\"\",,COUNTIF($B$5:B30,\">0\")+1)","v":0},{"$f":"IF(AO31>0,veriler!C31,\"\")","v":""},{"$f":"IF(C31>0,CONCATENATE(veriler!F31,\"(\",veriler!E31,\")\"),\"\")","v":"()"},{"$f":"IF(C31>0,veriler!G31,\"\")","v":0},{"$f":"IFERROR(IF(C31>0,IF(veriler!K31<veriler!AF31,veriler!K31,veriler!AF31)),\"\")","v":""},{"$f":"IFERROR(IF(C31>0,veriler!AG31,0),\"\")","v":""},{"$f":"IFERROR(IF(C31>0,veriler!AO31,0),\"\")","v":0},{"$f":"IFERROR(IF(C31>0,veriler!AL31,0),\"\")","v":0},{"$f":"IFERROR(IF(C31>0,IF(veriler!BI31>0,veriler!BI31,0)),0)","v":0},null,{"$f":"IF(C31>0,veriler!BF31,0)","v":""},{"$f":"IF(C31>0,veriler!BG31,0)","v":""},0,{"$f":"IF(C31>0,veriler!H31,0)","v":0},{"$f":"IF(C31>0,veriler!V31,0)","v":0},{"$f":"IF(C31>0,veriler!W31,0)","v":0},{"$f":"IF(C31>0,veriler!X31,0)","v":0},{"$f":"IF(C31>0,veriler!Y31,0)","v":0},null,0,{"$f":"IF(C31>0,veriler!Z31,0)","v":0},{"$f":"IF(C31>0,veriler!AA31,0)","v":0},{"$f":"IF(C31>0,IF(veriler!BJ31>0,veriler!BJ31,0))","v":0},{"$f":"IF(C31>0,IF(veriler!BK31>0,veriler!BK31,0))","v":0},{"$f":"ANASAYFA!$B$21","v":20.448540000000001},0,0,{"$f":"ANASAYFA!$B$25","v":25.560675},0,{"$f":"ANASAYFA!$B$26","v":21.470967000000002},0,{"$f":"ANASAYFA!$B$27","v":23.515821000000003},0,0,null,null,{"$error":"#VALUE!"}]
[null,{"$f":"IF(C32=\"\",,COUNTIF($B$5:B31,\">0\")+1)","v":0},{"$f":"IF(AO32>0,veriler!C32,\"\")","v":""},{"$f":"IF(C32>0,CONCATENATE(veriler!F32,\"(\",veriler!E32,\")\"),\"\")","v":"()"},{"$f":"IF(C32>0,veriler!G32,\"\")","v":0},{"$f":"IFERROR(IF(C32>0,IF(veriler!K32<veriler!AF32,veriler!K32,veriler!AF32)),\"\")","v":""},{"$f":"IFERROR(IF(C32>0,veriler!AG32,0),\"\")","v":""},{"$f":"IFERROR(IF(C32>0,veriler!AO32,0),\"\")","v":0},{"$f":"IFERROR(IF(C32>0,veriler!AL32,0),\"\")","v":0},{"$f":"IFERROR(IF(C32>0,IF(veriler!BI32>0,veriler!BI32,0)),0)","v":0},null,{"$f":"IF(C32>0,veriler!BF32,0)","v":""},{"$f":"IF(C32>0,veriler!BG32,0)","v":""},0,{"$f":"IF(C32>0,veriler!H32,0)","v":0},{"$f":"IF(C32>0,veriler!V32,0)","v":0},{"$f":"IF(C32>0,veriler!W32,0)","v":0},{"$f":"IF(C32>0,veriler!X32,0)","v":0},{"$f":"IF(C32>0,veriler!Y32,0)","v":0},null,0,{"$f":"IF(C32>0,veriler!Z32,0)","v":0},{"$f":"IF(C32>0,veriler!AA32,0)","v":0},{"$f":"IF(C32>0,IF(veriler!BJ32>0,veriler!BJ32,0))","v":0},{"$f":"IF(C32>0,IF(veriler!BK32>0,veriler!BK32,0))","v":0},{"$f":"ANASAYFA!$B$21","v":20.448540000000001},0,0,{"$f":"ANASAYFA!$B$25","v":25.560675},0,{"$f":"ANASAYFA!$B$26","v":21.470967000000002},0,{"$f":"ANASAYFA!$B$27","v":23.515821000000003},0,0,null,null,{"$error":"#VALUE!"}]
[null,{"$f":"IF(C33=\"\",,COUNTIF($B$5:B32,\">0\")+1)","v":0},{"$f":"IF(AO33>0,veriler!C33,\"\")","v":""},{"$f":"IF(C33>0,CONCATENATE(veriler!F33,\"(\",veriler!E33,\")\"),\"\")","v":"()"},{"$f":"IF(C33>0,veriler!G33,\"\")","v":0},{"$f":"IFERROR(IF(C33>0,IF(veriler!K33<veriler!AF33,veriler!K33,veriler!AF33)),\"\")","v":""},{"$f":"IFERROR(IF(C33>0,veriler!AG33,0),\"\")","v":""},{"$f":"IFERROR(IF(C33>0,veriler!AO33,0),\"\")","v":0},{"$f":"IFERROR(IF(C33>0,veriler!AL33,0),\"\")","v":0},{"$f":"IFERROR(IF(C33>0,IF(veriler!BI33>0,veriler!BI33,0)),0)","v":0},null,{"$f":"IF(C33>0,veriler!BF33,0)","v":""},{"$f":"IF(C33>0,veriler!BG33,0)","v":""},0,{"$f":"IF(C33>0,veriler!H33,0)","v":0},{"$f":"IF(C33>0,veriler!V33,0)","v":0},{"$f":"IF(C33>0,veriler!W33,0)","v":0},{"$f":"IF(C33>0,veriler!X33,0)","v":0},{"$f":"IF(C33>0,veriler!Y33,0)","v":0},null,0,{"$f":"IF(C33>0,veriler!Z33,0)","v":0},{"$f":"IF(C33>0,veriler!AA33,0)","v":0},{"$f":"IF(C33>0,IF(veriler!BJ33>0,veriler!BJ33,0))","v":0},{"$f":"IF(C33>0,IF(veriler!BK33>0,veriler!BK33,0))","v":0},{"$f":"ANASAYFA!$B$21","v":20.448540000000001},0,0,{"$f":"ANASAYFA!$B$25","v":25.560675},0,{"$f":"ANASAYFA!$B$26","v":21.470967000000002},0,{"$f":"ANASAYFA!$B$27","v":23.515821000000003},0,0,null,null,{"$error":"#VALUE!"}]
[null,{"$f":"IF(C34=\"\",,COUNTIF($B$5:B33,\">0\")+1)","v":0},{"$f":"IF(AO34>0,veriler!C34,\"\")","v":""},{"$f":"IF(C34>0,CONCATENATE(veriler!F34,\"(\",veriler!E34,\")\"),\"\")","v":"()"},{"$f":"IF(C34>0,veriler!G34,\"\")","v":0},{"$f":"IFERROR(IF(C34>0,IF(veriler!K34<veriler!AF34,veriler!K34,veriler!AF34)),\"\")","v":""},{"$f":"IFERROR(IF(C34>0,veriler!AG34,0),\"\")","v":""},{"$f":"IFERROR(IF(C34>0,veriler!AO34,0),\"\")","v":0},{"$f":"IFERROR(IF(C34>0,veriler!AL34,0),\"\")","v":0},{"$f":"IFERROR(IF(C34>0,IF(veriler!BI34>0,veriler!BI34,0)),0)","v":0},null,{"$f":"IF(C34>0,veriler!BF34,0)","v":""},{"$f":"IF(C34>0,veriler!BG34,0)","v":""},0,{"$f":"IF(C34>0,veriler!H34,0)","v":0},{"$f":"IF(C34>0,veriler!V34,0)","v":0},{"$f":"IF(C34>0,veriler!W34,0)","v":0},{"$f":"IF(C34>0,veriler!X34,0)","v":0},{"$f":"IF(C34>0,veriler!Y34,0)","v":0},null,0,{"$f":"IF(C34>0,veriler!Z34,0)","v":0},{"$f":"IF(C34>0,veriler!AA34,0)","v":0},{"$f":"IF(C34>0,IF(veriler!BJ34>0,veriler!BJ34,0))","v":0},{"$f":"IF(C34>0,IF(veriler!BK34>0,veriler!BK34,0))","v":0},{"$f":"ANASAYFA!$B$21","v":20.448540000000001},0,0,{"$f":"ANASAYFA!$B$25","v":25.560675},0,{"$f":"ANASAYFA!$B$26","v":21.470967000000002},0,{"$f":"ANASAYFA!$B$27","v":23.515821000000003},0,0,null,null,{"$error":"#VALUE!"}]
[]
[null,"TC",null,null,null,null,null,null,null,null,null,null,null,null,null,null,null,"TC"]
[null,{"$f":"ANASAYFA!L3","v":"ULUBORLU KAYMAKAMLIĞI"},null,null,null,null,null,null,null,null,null,null,null,null,null,null,null,{"$f":"ANASAYFA!L3","v":"ULUBORLU KAYMAKAMLIĞI"}]
[null,{"$f":"ANASAYFA!L6","v":"Uluborlu Mesleki Ve Teknik Anadolu Lisesi Müdürlüğü"},null,null,null,null,null,null,null,null,null,null,null,null,null,null,null,{"$f":"ANASAYFA!L5","v":"ULUBORLU İLÇE MİLLİ EĞİTİM MÜDÜRLÜĞÜ"}]
[]
[null,"Sayı  :","82452652-20-E.476807",null,null,null,null,null,null,null,null,null,null,null,"2020-01-08",null,null,"Sayı  :","84303886- 020/",null,null,null,null,null,null,null,null,null,null,null,null,null,null,null,"…./…/2020"]
[null,"Konu:","Ek Ders Ücret Onayı",null,null,null,null,null,null,null,null,null,null,null,null,null,null,"Konu:","Ek Ders Ücret Onayı"]
[]
[]
[null,"ULUBORLU İLÇE MİLLİ EĞİTİM MÜDÜRLÜĞÜNE",null,null,null,null,null,null,null,null,null,null,null,null,null,null,null,"KAYMAKAMLIK MAKAMINA"]
[null,null,null,null,null,null,null,null,null,null,null,null,null,null,null,null,null,"ULUBORLU"]
[]
[null,{"$f":"\"       \"&B38&\"nde, ücretli ders okutan Yönetici ve öğretmenlerin durumu yukarıya çıkartılmıştır.\n\n      Bilgilerinizi ve gerekli  olurun verilmesini  arz ederim.\"","v":"       Uluborlu Mesleki Ve Teknik Anadolu Lisesi Müdürlüğünde, ücretli ders okutan Yönetici ve öğretmenlerin durumu yukarıya çıkartılmıştır.\n\n      Bilgilerinizi ve gerekli  olurun verilmesini  arz ederim."},null,null,null,null,null,null,null,null,null,null,null,null,null,null,null,{"$f":"CONCATENATE(\"     \",AR2,\" \",AR3,\" \",AR5)","v":"     İlçemiz Uluborlu Mesleki Ve Teknik Anadolu Lisesi ücretli ders okutan yönetici ve öğretmenlerin,durumu yukarıda çizelge halinde sunulmuştur. 439 sayılı Kanun ve MEB Yönetici ve Öğretmenlerin ders ve ek Ders saatlerine ilişkin esaslar doğrultusunda  okutulan ücretli derslerin, ek ders ücreti olarak ödenmesine müsadelerinize arz ederim"}]
[]
[]
[]
[]
[]
[null,null,null,null,null,null,null,null,null,null,null,null,null,null,{"$f":"ANASAYFA!B35","v":"Ruhi İLHAN"},null,null,null,null,null,null,null,null,null,null,null,null,null,null,null,null,null,null,null,{"$f":"ANASAYFA!B36","v":"Mustafa KABASAKAL"}]
[null,null,null,null,null,null,null,null,null,null,null,null,null,null,{"$f":"ANASAYFA!C35","v":"Okul Müdürü"},null,null,null,null,null,null,null,null,null,null,null,null,null,null,null,null,null,null,null,{"$f":"ANASAYFA!C36","v":"İlçe Milli Eğitim Müdürü"}]
[]
[]
[]
[null,null,null,null,null,null,null,null,null,null,null,null,null,null,null,null,null,"…../…../2020"]
[null,null,null,null,null,null,null,null,null,null,null,null,null,null,null,null,null,"UYGUNDUR"]
[]
[null,null,null,null,null,null,null,null,null,null,null,null,null,null,null,null,null,{"$f":"ANASAYFA!B37","v":"Şahin DEMİR"}]
[null,null,null,null,null,null,null,null,null,null,null,null,null,null,null,null,null,{"$f":"ANASAYFA!C37","v":"Kaymakam"}]

{"sheet":"Pansiyon","index":3,"n_rows":62,"n_cols":9,"rows_kept":62,"cut":false,"hidden":false,"merged":[[43,1,43,4],[57,6,57,8],[58,6,58,8],[60,6,60,8],[61,6,61,8],[43,6,43,8],[45,6,50,8],[45,1,50,4],[36,6,36,8],[37,6,37,8],[38,6,38,8],[36,1,36,4],[37,1,37,4],[38,1,38,4],[1,5,4,5],[1,6,4,6],[1,1,4,1],[0,1,0,8],[2,8,4,8],[1,7,4,7],[1,2,4,2],[1,3,4,3],[1,4,4,4]]}
[null,{"$f":"CONCATENATE(ANASAYFA!B5,\" \",ANASAYFA!B6,\"EĞİTİM ÖĞRETİM YILI\",\" \",ANASAYFA!B7,\".\",\" \",\"DÖNEM\",\" \",\"PANSİYONDA NÖBET  TUTAN   ÖĞRETMENLERİN  EK DERS ÜCRETLERİNİ GÖSTERİR ÜCRET ONAY ÇİZELGESİ \")","v":"ULUBORLU MESLEKİ VE TEKNİK ANADOLU LİSESİ 2019-2020EĞİTİM ÖĞRETİM YILI 1. DÖNEM PANSİYONDA NÖBET  TUTAN   ÖĞRETMENLERİN  EK DERS ÜCRETLERİNİ GÖSTERİR ÜCRET ONAY ÇİZELGESİ "}]
[null,"S. No","Adı ve Soyadı","Görevi ve Branşı ","Belletmenlik Nöbet Saati ","Belletmenlik   Bürüt Ücret Tutarı","Nöbet Başına Ödenecek Bürüt Ücret Tutarı ","Ücretli Ders Görevinin Başladığı Tarih",{"$f":"CONCATENATE(\"Mali Yıl :\",ANASAYFA!B8,\" \n\",\"Ay : \",ANASAYFA!B9)","v":"Mali Yıl :2020 \nAy : OCAK"}]
[null,null,null,null,null,null,null,null,"Açıklamalar"]
[]
[]
[null,{"$f":"IF(C6=\"\",,ROUNDUP(ROWS($B$6:B6)/1,0))","v":0},{"$f":"IF(E6>0,veriler!C5,\"\")","v":""},{"$f":"IF(C6>0,CONCATENATE(veriler!F5,veriler!BV5),\"\")","v":"Müdür"},0,{"$f":"ANASAYFA!$B$21","v":20.448540000000001},{"$f":"E6*F6","v":0},"2019-09-08"]
[null,{"$f":"IF(C7=\"\",,COUNTIF($B$6:B6,\">0\")+1)","v":0},{"$f":"IF(E7>0,veriler!C6,\"\")","v":""},{"$f":"IF(C7>0,CONCATENATE(veriler!F6,veriler!BV6),\"\")","v":"Müdür Baş Yard"},0,{"$f":"ANASAYFA!$B$21","v":20.448540000000001},0,"2019-09-08"]
[null,{"$f":"IF(C8=\"\",,COUNTIF($B$6:B7,\">0\")+1)","v":0},{"$f":"IF(E8>0,veriler!C7,\"\")","v":""},{"$f":"IF(C8>0,CONCATENATE(veriler!F7,veriler!BV7),\"\")","v":"Müdür Yardımcısı"},0,{"$f":"ANASAYFA!$B$21","v":20.448540000000001},0,"2019-09-08"]
[null,{"$f":"IF(C9=\"\",,COUNTIF($B$6:B8,\">0\")+1)","v":0},{"$f":"IF(E9>0,veriler!C8,\"\")","v":""},{"$f":"IF(C9>0,CONCATENATE(veriler!F8,veriler!BV8),\"\")","v":"Müdür Yardımcısı"},0,{"$f":"ANASAYFA!$B$21","v":20.448540000000001},0,"2019-09-08"]
[null,{"$f":"IF(C10=\"\",,COUNTIF($B$6:B9,\">0\")+1)","v":1},{"$f":"IF(E10>0,veriler!C9,\"\")","v":"MUAMMER KAYAKUŞ"},{"$f":"IF(C10>0,CONCATENATE(veriler!F9,veriler!BV9),\"\")","v":"Atölye/Lab Şefi"},7,{"$f":"ANASAYFA!$B$21","v":20.448540000000001},143.13978,"2019-09-08"]
[null,{"$f":"IF(C11=\"\",,COUNTIF($B$6:B10,\">0\")+1)","v":2},{"$f":"IF(E11>0,veriler!C10,\"\")","v":"MEHMET GÜLAY"},{"$f":"IF(C11>0,CONCATENATE(veriler!F10,veriler!BV10),\"\")","v":"Alan Şefi"},7,{"$f":"ANASAYFA!$B$21","v":20.448540000000001},143.13978,"2019-09-08"]
[null,{"$f":"IF(C12=\"\",,COUNTIF($B$6:B11,\">0\")+1)","v":0},{"$f":"IF(E12>0,veriler!C11,\"\")","v":""},{"$f":"IF(C12>0,CONCATENATE(veriler!F11,veriler!BV11),\"\")","v":"Öğretmen"},0,{"$f":"ANASAYFA!$B$21","v":20.448540000000001},0,"2019-09-08"]
[null,{"$f":"IF(C13=\"\",,COUNTIF($B$6:B12,\">0\")+1)","v":0},{"$f":"IF(E13>0,veriler!C12,\"\")","v":""},{"$f":"IF(C13>0,CONCATENATE(veriler!F12,veriler!BV12),\"\")","v":"Öğretmen"},0,{"$f":"ANASAYFA!$B$21","v":20.448540000000001},0,"2019-09-08"]
[null,{"$f":"IF(C14=\"\",,COUNTIF($B$6:B13,\">0\")+1)","v":0},{"$f":"IF(E14>0,veriler!C13,\"\")","v":""},{"$f":"IF(C14>0,CONCATENATE(veriler!F13,veriler!BV13),\"\")","v":"Öğretmen"},0,{"$f":"ANASAYFA!$B$21","v":20.448540000000001},0,"2019-09-08"]
[null,{"$f":"IF(C15=\"\",,COUNTIF($B$6:B14,\">0\")+1)","v":0},{"$f":"IF(E15>0,veriler!C14,\"\")","v":""},{"$f":"IF(C15>0,CONCATENATE(veriler!F14,veriler!BV14),\"\")","v":"Öğretmen"},0,{"$f":"ANASAYFA!$B$21","v":20.448540000000001},0,"2019-09-08"]
[null,{"$f":"IF(C16=\"\",,COUNTIF($B$6:B15,\">0\")+1)","v":0},{"$f":"IF(E16>0,veriler!C15,\"\")","v":""},{"$f":"IF(C16>0,CONCATENATE(veriler!F15,veriler!BV15),\"\")","v":"Öğretmen"},0,{"$f":"ANASAYFA!$B$21","v":20.448540000000001},0,"2019-09-08"]
[null,{"$f":"IF(C17=\"\",,COUNTIF($B$6:B16,\">0\")+1)","v":0},{"$f":"IF(E17>0,veriler!C16,\"\")","v":""},{"$f":"IF(C17>0,CONCATENATE(veriler!F16,veriler!BV16),\"\")","v":"Atelye Öğretmeni"},0,{"$f":"ANASAYFA!$B$21","v":20.448540000000001},0,"2019-09-08"]
[null,{"$f":"IF(C18=\"\",,COUNTIF($B$6:B17,\">0\")+1)","v":0},{"$f":"IF(E18>0,veriler!C17,\"\")","v":""},{"$f":"IF(C18>0,CONCATENATE(veriler!F17,veriler!BV17),\"\")","v":"Öğretmen"},0,{"$f":"ANASAYFA!$B$21","v":20.448540000000001},0,"2019-09-08"]
[null,{"$f":"IF(C19=\"\",,COUNTIF($B$6:B18,\">0\")+1)","v":0},{"$f":"IF(E19>0,veriler!C18,\"\")","v":""},{"$f":"IF(C19>0,CONCATENATE(veriler!F18,veriler!BV18),\"\")","v":"Atelye Öğretmeni"},0,{"$f":"ANASAYFA!$B$21","v":20.448540000000001},0,"2019-09-08"]
[null,{"$f":"IF(C20=\"\",,COUNTIF($B$6:B19,\">0\")+1)","v":0},{"$f":"IF(E20>0,veriler!C19,\"\")","v":""},{"$f":"IF(C20>0,CONCATENATE(veriler!F19,veriler!BV19),\"\")","v":"Ücretli Öğretmen"},0,{"$f":"ANASAYFA!$B$21","v":20.448540000000001},0,"2019-09-08"]
[null,{"$f":"IF(C21=\"\",,COUNTIF($B$6:B20,\">0\")+1)","v":3},{"$f":"IF(E21>0,veriler!C20,\"\")","v":"SONER DOĞANAY"},{"$f":"IF(C21>0,CONCATENATE(veriler!F20,veriler!BV20),\"\")","v":"Sınıf Öğretmeni(Çakır Hasan Ortaokulu)"},7,{"$f":"ANASAYFA!$B$21","v":20.448540000000001},143.13978,"2019-09-08"]
[null,{"$f":"IF(C22=\"\",,COUNTIF($B$6:B21,\">0\")+1)","v":0},{"$f":"IF(E22>0,veriler!C21,\"\")","v":""},{"$f":"IF(C22>0,CONCATENATE(veriler!F21,veriler!BV21),\"\")","v":""},0,{"$f":"ANASAYFA!$B$21","v":20.448540000000001},0,"2019-09-08"]
[null,{"$f":"IF(C23=\"\",,COUNTIF($B$6:B22,\">0\")+1)","v":0},{"$f":"IF(E23>0,veriler!C22,\"\")","v":""},{"$f":"IF(C23>0,CONCATENATE(veriler!F22,veriler!BV22),\"\")","v":""},0,{"$f":"ANASAYFA!$B$21","v":20.448540000000001},0,"2019-09-08"]
[null,{"$f":"IF(C24=\"\",,COUNTIF($B$6:B23,\">0\")+1)","v":0},{"$f":"IF(E24>0,veriler!C23,\"\")","v":""},{"$f":"IF(C24>0,CONCATENATE(veriler!F23,veriler!BV23),\"\")","v":""},0,{"$f":"ANASAYFA!$B$21","v":20.448540000000001},0,"2019-09-08"]
[null,{"$f":"IF(C25=\"\",,COUNTIF($B$6:B24,\">0\")+1)","v":0},{"$f":"IF(E25>0,veriler!C24,\"\")","v":""},{"$f":"IF(C25>0,CONCATENATE(veriler!F24,veriler!BV24),\"\")","v":""},0,{"$f":"ANASAYFA!$B$21","v":20.448540000000001},0,"2019-09-08"]
[null,{"$f":"IF(C26=\"\",,COUNTIF($B$6:B25,\">0\")+1)","v":0},{"$f":"IF(E26>0,veriler!C25,\"\")","v":""},{"$f":"IF(C26>0,CONCATENATE(veriler!F25,veriler!BV25),\"\")","v":""},0,{"$f":"ANASAYFA!$B$21","v":20.448540000000001},0,"2019-09-08"]
[null,{"$f":"IF(C27=\"\",,COUNTIF($B$6:B26,\">0\")+1)","v":0},{"$f":"IF(E27>0,veriler!C26,\"\")","v":""},{"$f":"IF(C27>0,CONCATENATE(veriler!F26,veriler!BV26),\"\")","v":""},0,{"$f":"ANASAYFA!$B$21","v":20.448540000000001},0,"2019-09-08"]
[null,{"$f":"IF(C28=\"\",,COUNTIF($B$6:B27,\">0\")+1)","v":0},{"$f":"IF(E28>0,veriler!C27,\"\")","v":""},{"$f":"IF(C28>0,CONCATENATE(veriler!F27,veriler!BV27),\"\")","v":""},0,{"$f":"ANASAYFA!$B$21","v":20.448540000000001},0,"2019-09-08"]
[null,{"$f":"IF(C29=\"\",,COUNTIF($B$6:B28,\">0\")+1)","v":0},{"$f":"IF(E29>0,veriler!C28,\"\")","v":""},{"$f":"IF(C29>0,CONCATENATE(veriler!F28,veriler!BV28),\"\")","v":""},0,{"$f":"ANASAYFA!$B$21","v":20.448540000000001},0,"2019-09-08"]
[null,{"$f":"IF(C30=\"\",,COUNTIF($B$6:B29,\">0\")+1)","v":0},{"$f":"IF(E30>0,veriler!C29,\"\")","v":""},{"$f":"IF(C30>0,CONCATENATE(veriler!F29,veriler!BV29),\"\")","v":""},0,{"$f":"ANASAYFA!$B$21","v":20.448540000000001},0,"2019-09-08"]
[null,{"$f":"IF(C31=\"\",,COUNTIF($B$6:B30,\">0\")+1)","v":0},{"$f":"IF(E31>0,veriler!C30,\"\")","v":""},{"$f":"IF(C31>0,CONCATENATE(veriler!F30,veriler!BV30),\"\")","v":""},0,{"$f":"ANASAYFA!$B$21","v":20.448540000000001},0,"2019-09-08"]
[null,{"$f":"IF(C32=\"\",,COUNTIF($B$6:B31,\">0\")+1)","v":0},{"$f":"IF(E32>0,veriler!C31,\"\")","v":""},{"$f":"IF(C32>0,CONCATENATE(veriler!F31,veriler!BV31),\"\")","v":""},0,{"$f":"ANASAYFA!$B$21","v":20.448540000000001},0,"2019-09-08"]
[null,{"$f":"IF(C33=\"\",,COUNTIF($B$6:B32,\">0\")+1)","v":0},{"$f":"IF(E33>0,veriler!C32,\"\")","v":""},{"$f":"IF(C33>0,CONCATENATE(veriler!F32,veriler!BV32),\"\")","v":""},0,{"$f":"ANASAYFA!$B$21","v":20.448540000000001},0,"2019-09-08"]
[null,{"$f":"IF(C34=\"\",,COUNTIF($B$6:B33,\">0\")+1)","v":0},{"$f":"IF(E34>0,veriler!C33,\"\")","v":""},{"$f":"IF(C34>0,CONCATENATE(veriler!F33,veriler!BV33),\"\")","v":""},0,{"$f":"ANASAYFA!$B$21","v":20.448540000000001},0,"2019-09-08"]
[null,{"$f":"IF(C35=\"\",,COUNTIF($B$6:B34,\">0\")+1)","v":0},{"$f":"IF(E35>0,veriler!C34,\"\")","v":""},{"$f":"IF(C35>0,CONCATENATE(veriler!F34,veriler!BV34),\"\")","v":""},0,{"$f":"ANASAYFA!$B$21","v":20.448540000000001},0,"2019-09-08"]
[]
[null,"T.C.",null,null,null,null,"T.C"]
[null,{"$f":"ANASAYFA!L3","v":"ULUBORLU KAYMAKAMLIĞI"},null,null,null,null,{"$f":"ANASAYFA!L3","v":"ULUBORLU KAYMAKAMLIĞI"}]
[null,{"$f":"ANASAYFA!L6","v":"Uluborlu Mesleki Ve Teknik Anadolu Lisesi Müdürlüğü"},null,null,null,null,{"$f":"ANASAYFA!L4","v":"İLÇE MİLLİ EĞİTİM MÜDÜRLÜĞÜ"}]
[]
[null,"Sayı:","82452652-20-E.476807",null,"2020-01-08",null,"Sayı:84303886- 020/",null,"…./01/2020"]
[null,"Konu:","Pansiyon Ücret Onayı",null,null,null,"Konu: Pansiyon Ücret Onayı"]
[]
[null,"ULUBORLU İLÇE MİLLİ EĞİTİM MÜDÜRLÜĞÜNE ",null,null,null,null,"ULUBORLU KAYMAKAMLIK MAKAMINA"]
[]
[null,"      Uluborlu Mesleki ve Teknik Anadolu Lisesi Müdürlüğü pansiyonunda nöbet tutan öğretmenlere ait pansiyon ücret durumu yukarıya çıkarılmıştır.\n      Bilgilerinizi ve gerekli Kaymakamlık olurunun alınmasını arz ederim.",null,null,null,null,"        Okulumuz Uluborlu Mesleki ve Teknik Anadolu Lisesi Müdürlüğü pansiyonunda nöbet tutan  öğretmenlerin durumu yukarıya çizelge halinde sunulmuştur.Milli Eğitim Bakanlığı Ders ve Ekders saatlerine İlişkin Kararın \"Belleticilik görevi\" başlıklı 13.maddesi hükümlerine göre ve 25 Ağustos 2017 tarih ve 30165 sayılı Resmi Gazete'de yayımlanan \"Kamu Görevlilerinin Geneline ve Hizmet Kollarına İlişkin Toplu Sözleşme\" başlıklı kımındaki Belleticilik görevi verilen öğretmenlerin ekders ücreti başlıklı 12.maddesi doğrultusunda tutulan ücretli nöbetlerin ,ek ders  ücreti olarak ödenmesini tasviplerinize arz ederim. "]
[]
[]
[]
[]
[]
[]
[]
[null,null," "]
[null,null,null,null,{"$f":"ANASAYFA!B35","v":"Ruhi İLHAN"},null,null,null,{"$f":"ANASAYFA!B36","v":"Mustafa KABASAKAL"}]
[null,null,null,null,{"$f":"ANASAYFA!C35","v":"Okul Müdürü"},null,null,null,{"$f":"ANASAYFA!C36","v":"İlçe Milli Eğitim Müdürü"}]
[]
[null,null,null,null,null,null,"  …./01/2020"]
[null,null,null,null,null,null,"  UYGUNDUR"]
[]
[null,null,null,null,null,null,{"$f":"ANASAYFA!B37","v":"Şahin DEMİR"}]
[null,null,null,null,null,null,{"$f":"ANASAYFA!C37","v":"Kaymakam"}]

{"sheet":"işletme","index":4,"n_rows":71,"n_cols":22,"rows_kept":71,"cut":false,"hidden":false,"merged":[[69,8,69,13],[70,8,70,13],[57,4,57,5],[58,4,58,5],[45,8,45,13],[66,8,66,13],[67,8,67,13],[41,13,41,14],[44,8,44,13],[35,1,35,6],[14,7,14,8],[15,7,15,8],[16,7,16,8],[22,7,22,8],[28,7,28,8],[17,7,17,8],[18,7,18,8],[19,7,19,8],[23,7,23,8],[31,7,31,8],[26,7,26,8],[27,7,27,8],[20,7,20,8],[21,7,21,8],[29,7,29,8],[37,1,37,6],[44,1,44,6],[24,7,24,8],[25,7,25,8],[30,7,30,8],[36,1,36,6],[32,7,32,8],[0,1,0,13],[1,1,3,1],[1,2,2,2],[1,3,2,3],[1,4,1,6],[1,9,2,9],[1,10,2,10],[6,7,6,8],[8,7,8,8],[13,7,13,8],[9,7,9,8],[1,12,2,12],[3,7,3,8],[1,11,2,11],[1,7,2,8],[7,7,7,8],[4,7,4,8],[5,7,5,8],[10,7,10,8],[11,7,11,8],[12,7,12,8]]}
[null,{"$f":"CONCATENATE(ANASAYFA!B5,\" \",\"MÜDÜRLÜĞÜ\",\" \",ANASAYFA!B6,\" \",\"ÖĞRETİM YILI\",\" \",ANASAYFA!B7,\".\",\"DÖNEM DÖNEM \nÖĞRETMENLERİN  İŞLETMELERDE MESLEKİ EĞİTİMİ   EK DERS ÜCRETLERİNİ GÖSTERİR ÇİZELGE\")","v":"ULUBORLU MESLEKİ VE TEKNİK ANADOLU LİSESİ MÜDÜRLÜĞÜ 2019-2020 ÖĞRETİM YILI 1.DÖNEM DÖNEM \nÖĞRETMENLERİN  İŞLETMELERDE MESLEKİ EĞİTİMİ   EK DERS ÜCRETLERİNİ GÖSTERİR ÇİZELGE"}]
[null,"S.N","Adı Soyadı","Görevi \nve \nBranşı","Haftalık Okutacağı\n Derslerin",null,null,"Öğrencilerin Staj Yaptığı İşletmeler ",null,"Ders Dışı Egzersiz\nGörevi Ücreti Saati","İşletmelerde Haftalık Ücretli\nDers Saati Toplamı","İşletmelerde Ücretli Dersin Saat Başı Bürüt Ücreti","Haftalık Ödenecek\nÜcret Tutarı",{"$f":"CONCATENATE(\"Mali Yıl:\",\" \",ANASAYFA!B8,\"\n \",\"Ay:\",\" \",ANASAYFA!B9)","v":"Mali Yıl: 2020\n Ay: OCAK"}]
[null,null,null,null,"Maaş Karşılığı","İşletmede Mesleki Eğitim Ücret Karşılığı","Toplam",null,null,null,null,null,null,"Açıklamalar"]
[null,null,1,2,3,4,5,6,null,13,7,8,9,10]
[null,{"$f":"IF(C5=\"\",,ROUNDUP(ROWS($B$5:B5)/1,0))","v":0},{"$f":"IF(P5>0,veriler!C5,\"\")","v":""},{"$f":"IF(C5>0,CONCATENATE(veriler!F5,\"(\",veriler!E5,\")\"),\"\")","v":"Müdür(Coğrafya)"},{"$f":"IF(C5>0,veriler!AF5,\"\")","v":0},5,{"$f":"SUM(E5:F5)","v":5},"Dolunay Harita, Çak Metal, Asil Harita, Alp Harita",null,null,{"$f":"F5","v":5},{"$f":"ANASAYFA!$B$21","v":20.448540000000001},{"$f":"K5*L5","v":102.24270000000001},null,null,0,null,null,null,null,null,""]
[null,{"$f":"IF(C6=\"\",,COUNTIF($B$5:B5,\">0\")+1)","v":0},{"$f":"IF(P6>0,veriler!C6,\"\")","v":""},{"$f":"IF(C6>0,CONCATENATE(veriler!F6,\"(\",veriler!E6,\")\"),\"\")","v":"Müdür Baş Yard(Elekt-Elektr.)"},{"$f":"IF(C6>0,veriler!AF6,\"\")","v":0},10,{"$f":"SUM(E6:F6)","v":10},"Keçiborlu Belediyesi, Hak Gülyağı Fab., Altıntaş Demnir Doğrama, Topçuoğlu Demir Doğrama",null,null,{"$f":"F6","v":10},{"$f":"ANASAYFA!$B$21","v":20.448540000000001},{"$f":"K6*L6","v":204.48540000000003},null,null,0]
[null,{"$f":"IF(C7=\"\",,COUNTIF($B$5:B6,\">0\")+1)","v":0},{"$f":"IF(P7>0,veriler!C7,\"\")","v":""},{"$f":"IF(C7>0,CONCATENATE(veriler!F7,\"(\",veriler!E7,\")\"),\"\")","v":"Müdür Yardımcısı(Bilgisayar)"},{"$f":"IF(C7>0,veriler!AF7,\"\")","v":0},null,{"$f":"SUM(E7:F7)","v":0},"Göltaş Çimento - BLS Makine Fabrikası",null,null,0,{"$f":"ANASAYFA!$B$21","v":20.448540000000001},0,null,null,0]
[null,{"$f":"IF(C8=\"\",,COUNTIF($B$5:B7,\">0\")+1)","v":0},{"$f":"IF(P8>0,veriler!C8,\"\")","v":""},{"$f":"IF(C8>0,CONCATENATE(veriler!F8,\"(\",veriler!E8,\")\"),\"\")","v":"Müdür Yardımcısı(Beden Eğitimi)"},{"$f":"IF(C8>0,veriler!AF8,\"\")","v":0},5,{"$f":"SUM(E8:F8)","v":5},"Güner Demir Doğrama, Uluborlu Belediyesi",null,null,5,{"$f":"ANASAYFA!$B$21","v":20.448540000000001},102.24270000000001,null,null,0]
[null,{"$f":"IF(C9=\"\",,COUNTIF($B$5:B8,\">0\")+1)","v":1},{"$f":"IF(P9>0,veriler!C9,\"\")","v":"MUAMMER KAYAKUŞ"},{"$f":"IF(C9>0,CONCATENATE(veriler!F9,\"(\",veriler!E9,\")\"),\"\")","v":"Atölye/Lab Şefi(Elekt-Elektr.)"},{"$f":"IF(C9>0,veriler!AF9,\"\")","v":0},1,1,null,null,null,1,{"$f":"ANASAYFA!$B$21","v":20.448540000000001},20.448540000000001,null,null,1]
[null,{"$f":"IF(C10=\"\",,COUNTIF($B$5:B9,\">0\")+1)","v":2},{"$f":"IF(P10>0,veriler!C10,\"\")","v":"MEHMET GÜLAY"},{"$f":"IF(C10>0,CONCATENATE(veriler!F10,\"(\",veriler!E10,\")\"),\"\")","v":"Alan Şefi(Metal İşl. )"},{"$f":"IF(C10>0,veriler!AF10,\"\")","v":0},null,0,null,null,null,0,{"$f":"ANASAYFA!$B$21","v":20.448540000000001},0,null,null,1]
[null,{"$f":"IF(C11=\"\",,COUNTIF($B$5:B10,\">0\")+1)","v":0},{"$f":"IF(P11>0,veriler!C11,\"\")","v":""},{"$f":"IF(C11>0,CONCATENATE(veriler!F11,\"(\",veriler!E11,\")\"),\"\")","v":"Öğretmen(Matematik)"},{"$f":"IF(C11>0,veriler!AF11,\"\")","v":0},null,0,null,null,null,0,{"$f":"ANASAYFA!$B$21","v":20.448540000000001},0,null,null,0]
[null,{"$f":"IF(C12=\"\",,COUNTIF($B$5:B11,\">0\")+1)","v":0},{"$f":"IF(P12>0,veriler!C12,\"\")","v":""},{"$f":"IF(C12>0,CONCATENATE(veriler!F12,\"(\",veriler!E12,\")\"),\"\")","v":"Öğretmen(Fizik)"},{"$f":"IF(C12>0,veriler!AF12,\"\")","v":0},null,0,null,null,null,0,{"$f":"ANASAYFA!$B$21","v":20.448540000000001},0,null,null,0]
[null,{"$f":"IF(C13=\"\",,COUNTIF($B$5:B12,\">0\")+1)","v":0},{"$f":"IF(P13>0,veriler!C13,\"\")","v":""},{"$f":"IF(C13>0,CONCATENATE(veriler!F13,\"(\",veriler!E13,\")\"),\"\")","v":"Öğretmen(Kimya)"},{"$f":"IF(C13>0,veriler!AF13,\"\")","v":0},null,0,null,null,null,0,{"$f":"ANASAYFA!$B$21","v":20.448540000000001},0,null,null,0]
[null,{"$f":"IF(C14=\"\",,COUNTIF($B$5:B13,\">0\")+1)","v":0},{"$f":"IF(P14>0,veriler!C14,\"\")","v":""},{"$f":"IF(C14>0,CONCATENATE(veriler!F14,\"(\",veriler!E14,\")\"),\"\")","v":"Öğretmen(İngilizce)"},{"$f":"IF(C14>0,veriler!AF14,\"\")","v":0},null,0,null,null,null,0,{"$f":"ANASAYFA!$B$21","v":20.448540000000001},0,null,null,0]
[null,{"$f":"IF(C15=\"\",,COUNTIF($B$5:B14,\">0\")+1)","v":0},{"$f":"IF(P15>0,veriler!C15,\"\")","v":""},{"$f":"IF(C15>0,CONCATENATE(veriler!F15,\"(\",veriler!E15,\")\"),\"\")","v":"Öğretmen(Din Kültürü Ve Ahl.Bilgisi)"},{"$f":"IF(C15>0,veriler!AF15,\"\")","v":0},null,0,null,null,null,0,{"$f":"ANASAYFA!$B$21","v":20.448540000000001},0,null,null,0]
[null,{"$f":"IF(C16=\"\",,COUNTIF($B$5:B15,\">0\")+1)","v":3},{"$f":"IF(P16>0,veriler!C16,\"\")","v":"KARDİYE KÖK"},{"$f":"IF(C16>0,CONCATENATE(veriler!F16,\"(\",veriler!E16,\")\"),\"\")","v":"Atelye Öğretmeni(Harita-Tapu-Kadastro)"},{"$f":"IF(C16>0,veriler!AF16,\"\")","v":0},null,0,null,null,null,0,{"$f":"ANASAYFA!$B$21","v":20.448540000000001},0,null,null,1]
[null,{"$f":"IF(C17=\"\",,COUNTIF($B$5:B16,\">0\")+1)","v":0},{"$f":"IF(P17>0,veriler!C17,\"\")","v":""},{"$f":"IF(C17>0,CONCATENATE(veriler!F17,\"(\",veriler!E17,\")\"),\"\")","v":"Öğretmen(Türk Dili ve Edebiyatı)"},{"$f":"IF(C17>0,veriler!AF17,\"\")","v":0},null,0,null,null,null,0,{"$f":"ANASAYFA!$B$21","v":20.448540000000001},0,null,null,0]
[null,{"$f":"IF(C18=\"\",,COUNTIF($B$5:B17,\">0\")+1)","v":4},{"$f":"IF(P18>0,veriler!C18,\"\")","v":"HATİCE UYSAL"},{"$f":"IF(C18>0,CONCATENATE(veriler!F18,\"(\",veriler!E18,\")\"),\"\")","v":"Atelye Öğretmeni(Metal İşl. )"},{"$f":"IF(C18>0,veriler!AF18,\"\")","v":0},null,0,null,null,null,0,{"$f":"ANASAYFA!$B$21","v":20.448540000000001},0,null,null,1]
[null,{"$f":"IF(C19=\"\",,COUNTIF($B$5:B18,\">0\")+1)","v":0},{"$f":"IF(P19>0,veriler!C19,\"\")","v":""},{"$f":"IF(C19>0,CONCATENATE(veriler!F19,\"(\",veriler!E19,\")\"),\"\")","v":"Ücretli Öğretmen(Fizik)"},{"$f":"IF(C19>0,veriler!AF19,\"\")","v":0},null,0,null,null,null,0,{"$f":"ANASAYFA!$B$21","v":20.448540000000001},0,null,null,0]
[null,{"$f":"IF(C20=\"\",,COUNTIF($B$5:B19,\">0\")+1)","v":0},{"$f":"IF(P20>0,veriler!C20,\"\")","v":""},{"$f":"IF(C20>0,CONCATENATE(veriler!F20,\"(\",veriler!E20,\")\"),\"\")","v":"Sınıf Öğretmeni(Beden Eğitimi)"},{"$f":"IF(C20>0,veriler!AF20,\"\")","v":0},null,0,null,null,null,0,{"$f":"ANASAYFA!$B$21","v":20.448540000000001},0,null,null,0]
[null,{"$f":"IF(C21=\"\",,COUNTIF($B$5:B20,\">0\")+1)","v":0},{"$f":"IF(P21>0,veriler!C21,\"\")","v":""},{"$f":"IF(C21>0,CONCATENATE(veriler!F21,\"(\",veriler!E21,\")\"),\"\")","v":"()"},{"$f":"IF(C21>0,veriler!AF21,\"\")","v":""},null,0,null,null,null,0,{"$f":"ANASAYFA!$B$21","v":20.448540000000001},0,null,null,0]
[null,{"$f":"IF(C22=\"\",,COUNTIF($B$5:B21,\">0\")+1)","v":0},{"$f":"IF(P22>0,veriler!C22,\"\")","v":""},{"$f":"IF(C22>0,CONCATENATE(veriler!F22,\"(\",veriler!E22,\")\"),\"\")","v":"()"},{"$f":"IF(C22>0,veriler!AF22,\"\")","v":""},null,0,null,null,null,0,{"$f":"ANASAYFA!$B$21","v":20.448540000000001},0,null,null,0]
[null,{"$f":"IF(C23=\"\",,COUNTIF($B$5:B22,\">0\")+1)","v":0},{"$f":"IF(P23>0,veriler!C23,\"\")","v":""},{"$f":"IF(C23>0,CONCATENATE(veriler!F23,\"(\",veriler!E23,\")\"),\"\")","v":"()"},{"$f":"IF(C23>0,veriler!AF23,\"\")","v":""},null,0,null,null,null,0,{"$f":"ANASAYFA!$B$21","v":20.448540000000001},0,null,null,0]
[null,{"$f":"IF(C24=\"\",,COUNTIF($B$5:B23,\">0\")+1)","v":0},{"$f":"IF(P24>0,veriler!C24,\"\")","v":""},{"$f":"IF(C24>0,CONCATENATE(veriler!F24,\"(\",veriler!E24,\")\"),\"\")","v":"()"},{"$f":"IF(C24>0,veriler!AF24,\"\")","v":""},null,0,null,null,null,0,{"$f":"ANASAYFA!$B$21","v":20.448540000000001},0,null,null,0]
[null,{"$f":"IF(C25=\"\",,COUNTIF($B$5:B24,\">0\")+1)","v":0},{"$f":"IF(P25>0,veriler!C25,\"\")","v":""},{"$f":"IF(C25>0,CONCATENATE(veriler!F25,\"(\",veriler!E25,\")\"),\"\")","v":"()"},{"$f":"IF(C25>0,veriler!AF25,\"\")","v":""},null,0,null,null,null,0,{"$f":"ANASAYFA!$B$21","v":20.448540000000001},0,null,null,0]
[null,{"$f":"IF(C26=\"\",,COUNTIF($B$5:B25,\">0\")+1)","v":0},{"$f":"IF(P26>0,veriler!C26,\"\")","v":""},{"$f":"IF(C26>0,CONCATENATE(veriler!F26,\"(\",veriler!E26,\")\"),\"\")","v":"()"},{"$f":"IF(C26>0,veriler!AF26,\"\")","v":""},null,0,null,null,null,0,{"$f":"ANASAYFA!$B$21","v":20.448540000000001},0,null,null,0]
[null,{"$f":"IF(C27=\"\",,COUNTIF($B$5:B26,\">0\")+1)","v":0},{"$f":"IF(P27>0,veriler!C27,\"\")","v":""},{"$f":"IF(C27>0,CONCATENATE(veriler!F27,\"(\",veriler!E27,\")\"),\"\")","v":"()"},{"$f":"IF(C27>0,veriler!AF27,\"\")","v":""},null,0,null,null,null,0,{"$f":"ANASAYFA!$B$21","v":20.448540000000001},0,null,null,0]
[null,{"$f":"IF(C28=\"\",,COUNTIF($B$5:B27,\">0\")+1)","v":0},{"$f":"IF(P28>0,veriler!C28,\"\")","v":""},{"$f":"IF(C28>0,CONCATENATE(veriler!F28,\"(\",veriler!E28,\")\"),\"\")","v":"()"},{"$f":"IF(C28>0,veriler!AF28,\"\")","v":""},null,0,null,null,null,0,{"$f":"ANASAYFA!$B$21","v":20.448540000000001},0,null,null,0]
[null,{"$f":"IF(C29=\"\",,COUNTIF($B$5:B28,\">0\")+1)","v":0},{"$f":"IF(P29>0,veriler!C29,\"\")","v":""},{"$f":"IF(C29>0,CONCATENATE(veriler!F29,\"(\",veriler!E29,\")\"),\"\")","v":"()"},{"$f":"IF(C29>0,veriler!AF29,\"\")","v":""},null,0,null,null,null,0,{"$f":"ANASAYFA!$B$21","v":20.448540000000001},0,null,null,0]
[null,{"$f":"IF(C30=\"\",,COUNTIF($B$5:B29,\">0\")+1)","v":0},{"$f":"IF(P30>0,veriler!C30,\"\")","v":""},{"$f":"IF(C30>0,CONCATENATE(veriler!F30,\"(\",veriler!E30,\")\"),\"\")","v":"()"},{"$f":"IF(C30>0,veriler!AF30,\"\")","v":""},null,0,null,null,null,0,{"$f":"ANASAYFA!$B$21","v":20.448540000000001},0,null,null,0]
[null,{"$f":"IF(C31=\"\",,COUNTIF($B$5:B30,\">0\")+1)","v":0},{"$f":"IF(P31>0,veriler!C31,\"\")","v":""},{"$f":"IF(C31>0,CONCATENATE(veriler!F31,\"(\",veriler!E31,\")\"),\"\")","v":"()"},{"$f":"IF(C31>0,veriler!AF31,\"\")","v":""},null,0,null,null,null,0,{"$f":"ANASAYFA!$B$21","v":20.448540000000001},0,null,null,0]
[null,{"$f":"IF(C32=\"\",,COUNTIF($B$5:B31,\">0\")+1)","v":0},{"$f":"IF(P32>0,veriler!C32,\"\")","v":""},{"$f":"IF(C32>0,CONCATENATE(veriler!F32,\"(\",veriler!E32,\")\"),\"\")","v":"()"},{"$f":"IF(C32>0,veriler!AF32,\"\")","v":""},null,0,null,null,null,0,{"$f":"ANASAYFA!$B$21","v":20.448540000000001},0,null,null,0]
[null,{"$f":"IF(C33=\"\",,COUNTIF($B$5:B32,\">0\")+1)","v":0},{"$f":"IF(P33>0,veriler!C33,\"\")","v":""},{"$f":"IF(C33>0,CONCATENATE(veriler!F33,\"(\",veriler!E33,\")\"),\"\")","v":"()"},{"$f":"IF(C33>0,veriler!AF33,\"\")","v":""},null,0,null,null,null,0,{"$f":"ANASAYFA!$B$21","v":20.448540000000001},0,null,null,0]
[null,{"$f":"IF(C34=\"\",,COUNTIF($B$5:B33,\">0\")+1)","v":0},{"$f":"IF(P34>0,veriler!C34,\"\")","v":""},{"$f":"IF(C34>0,CONCATENATE(veriler!F34,\"(\",veriler!E34,\")\"),\"\")","v":"()"},{"$f":"IF(C34>0,veriler!AF34,\"\")","v":""},null,0,null,null,null,0,{"$f":"ANASAYFA!$B$21","v":20.448540000000001},0,null,null,0]
[]
[null,"T.C.",null,null,null,null,null,null,"T.C."]
[null,"ULUBORLU KAYMAKAMLIĞI",null,null,null,null,null,null,{"$f":"B37","v":"ULUBORLU KAYMAKAMLIĞI"}]
[null,"ULUBORLU MESLEKİ VE TEKNİK ANADOLU LİSESİ MÜDÜRLÜĞÜ",null,null,null,null,null,null,"İLÇE MİLLİ EĞİTİM MÜDÜRLÜĞÜ"]
[]
[]
[]
[null,"Sayı :"," 82452652-20-E.476807",null,null,"2020-01-08",null,null,"Sayı  :84303886- 020/",null,null,null,null,"…../01/2020"]
[null,"Konu :"," Koordinatörlük Görevi Ücret Onayı",null,null,null,null,null,"Konu  : Koordinatörlük Görevi Ücret Onayı"]
[null,null,null,null,null,null,null,null," "]
[null,"  ULUBORLU İLÇE MİLLİ EĞİTİM MÜDÜRLÜĞÜNE",null,null,null,null,null,null,"KAYMAKAMLIK MAKAMINA"]
[null,null,null,null,null,null,null,null,"ULUBORLU"]
[]
[]
[]
[null,null,"Uluborlu Mesleki ve Teknik Anadolu Lisesi'nde  İşletmelerde Mesleki Eğitimi  ücretli ",null,null,null,null,null,"        İlçemiz Uluborlu Mesleki ve Teknik Anadolu Lisesi öğretmenlerinden İşletmelerde Mesleki Eğitimi"]
[null,"ders okutan öğretmenlerin durumu yukarıya çıkartılmıştır.",null,null,null,null,null,null,"Ücretli Ders Okutan öğretmenlerin durumu yukarıda çizelge halinde sunulmuştur. 439 sayılı Kanun ve MEB Yönetici ve"]
[null,null,"Bilgilerinizi ve gerekli  olurun verilmesini  arz ederim.",null,null,null,null,null,"öğretmenlerin ders ve ek Ders saatlerine ilişkin esaslar doğrultusunda okutulan ücretli derslerin, ek ders ücreti "]
[null,null,null,null,null,null,null,null,"olarak ödenmesine müsadelerinize arz ederim"]
[]
[]
[]
[]
[null,null,null,null,{"$f":"ANASAYFA!B35","v":"Ruhi İLHAN"},null,null,null,null,null,null,null,null,{"$f":"ANASAYFA!B36","v":"Mustafa KABASAKAL"}]
[null,null,null,null,{"$f":"ANASAYFA!C35","v":"Okul Müdürü"},null,null,null,null,null,null,null,null,{"$f":"ANASAYFA!C36","v":"İlçe Milli Eğitim Müdürü"}]
[]
[]
[]
[]
[]
[]
[]
[null,null,null,null,null,null,null,null,"  …./01/2020"]
[null,null,null,null,null,null,null,null,"  UYGUNDUR"]
[]
[null,null,null,null,null,null,null,null,{"$f":"ANASAYFA!B37","v":"Şahin DEMİR"}]
[null,null,null,null,null,null,null,null,{"$f":"ANASAYFA!C37","v":"Kaymakam"}]

{"sheet":"DYK","index":5,"n_rows":81,"n_cols":29,"rows_kept":81,"cut":false,"hidden":false,"merged":[[6,15,7,15],[6,1,7,1],[6,2,7,2],[6,3,7,3],[6,4,7,4],[6,5,7,5],[6,6,7,6],[6,7,7,7],[6,8,7,8],[6,11,7,11],[6,12,7,12],[6,14,7,14],[6,13,7,13],[0,1,1,24],[3,1,3,2],[4,1,4,2],[46,1,46,24],[6,21,7,21],[6,22,7,22],[6,23,7,23],[6,24,7,24],[6,16,7,16],[6,17,7,17],[6,18,7,18],[6,19,7,19],[6,20,7,20],[6,9,7,9],[6,10,7,10],[39,1,39,24],[40,1,40,24],[41,1,41,24],[43,2,43,3],[43,22,43,24],[62,1,62,4],[48,2,48,24],[49,2,49,24],[50,2,50,24],[53,2,53,24],[54,1,54,24],[56,1,56,4],[56,20,56,24],[57,1,57,4],[57,20,57,24],[60,1,60,4],[61,1,61,4],[58,20,58,24],[68,1,68,24],[69,1,69,24],[63,1,63,4],[65,1,65,24],[66,1,66,24],[67,1,67,24]]}
[null,{"$f":"CONCATENATE(ANASAYFA!B5,\" \",\"MÜDÜRLÜĞÜ\",\" \",ANASAYFA!B6,\" \",\"ÖĞRETİM  YILI YÖNETİCİ VE ÖĞRETMENLERİNE AİT\",\" \",\"ÖRGÜN VE YAYGIN EĞİTİMİ DESTEKLEME VE YETİŞTİRME KURSU ÜCRET ONAY ÇİZELGESİ\")","v":"ULUBORLU MESLEKİ VE TEKNİK ANADOLU LİSESİ MÜDÜRLÜĞÜ 2019-2020 ÖĞRETİM  YILI YÖNETİCİ VE ÖĞRETMENLERİNE AİT ÖRGÜN VE YAYGIN EĞİTİMİ DESTEKLEME VE YETİŞTİRME KURSU ÜCRET ONAY ÇİZELGESİ"}]
[]
[]
[null,"Mali Yılı      :",null,{"$f":"ANASAYFA!B8","v":2020}]
[null,"Ay              :",null,{"$f":"ANASAYFA!B9","v":"OCAK"}]
[]
[null,"S.NO","TC. Numarası","Adı ve Soyadı","Görevi","Branşı","Öğrenim Durumu","Açılan Kursun Adı Ve \nOkutulan Sınıflar","Okullardaki Maaş Karşılığı","Okullardaki Haftalık Ücretli Ders Saati Toplamı","Ders Niteliğinde Yönetim\nGörevi Ücret Saati","Okullardaki Haftalık Kurs Saati Toplamı ","Toplam","Maaş Karşılığı Girdiği Kurs Toplamı","Okullardaki Haftalık  Ödenecek  Kurs Saati Toplamı ","Gündüz Okuttuğu Kurs Saati","Gece ve Hafta Sonu Okuttuğu Kurs Saati","Başlama ve Bitiş Tarihi","Kursun Açılma Şekli","Kursun Yapıldığı  Gün","Gündüz Saat Başı Bürüt Ücret","Haftalık Ödenecek Gündüz Ücret","Gece Saat Başı Bürüt Ücret","Haftalık Ödenecek Haftas Sonu ve Gece Ücreti","Çalışma Saatleri"]
[]
[null,{"$f":"IF(L9>0,ROUNDUP(ROWS($B$9:B9)/1,0),0)","v":0},{"$f":"IF(L9>0,veriler!D5,\"\")","v":""},{"$f":"IF(L9>0,veriler!C5,\"\")","v":""},{"$f":"IF(L9>0,veriler!F5,\"\")","v":""},{"$f":"IF(L9>0,veriler!E5,\"\")","v":""},{"$f":"IF(L9>0,veriler!G5,\"\")","v":""},"Matematik 11",{"$f":"IFERROR(IF(L9>0,IF(veriler!K5<veriler!AF5,veriler!K5+veriler!AG5,veriler!AF5),0),\"\")","v":0},{"$f":"IF(L9>0,IF(veriler!AJ5>0,veriler!AJ5,\"\"),0)","v":0},{"$f":"IF(L9>0,veriler!V5,0)","v":0},0,{"$f":"SUM(I9:L9)","v":0},{"$f":"IFERROR(IF(L9>0,veriler!AO5,0),\"\")","v":0},{"$f":"IF(L9>0,veriler!AL5+veriler!O5,\"\")","v":""},{"$f":"IF(L9>0,veriler!AT5,\"\")","v":""},{"$f":"IF(L9>0,veriler!AU5+veriler!AV5,\"\")","v":""},"03.10.2019 04.06.2020","Destekleme ve Yetiştirme Kursu","Perşembe",{"$f":"IF(G9=$AC$9,ANASAYFA!$B$22,IF(G9=$AC$10,ANASAYFA!$B$28,IF(G9=$AC$11,ANASAYFA!$B$31,\"\")))","v":""},{"$f":"IF(P9>0,P9*U9,\"\")","v":{"$error":"#VALUE!"}},{"$f":"IF(G9=$AC$9,ANASAYFA!$B$23,IF(G9=$AC$10,ANASAYFA!$B$29,IF(G9=$AC$11,ANASAYFA!$B$32,\"\")))","v":""},{"$f":"IF(Q9>0,Q9*W9,\"\")","v":{"$error":"#VALUE!"}},"15:25-16:05\n16:15-16:55",null,null,null,"Lisans"]
[null,{"$f":"IF(L10>0,COUNTIF($B$9:B9,\">0\")+1,0)","v":0},{"$f":"IF(L10>0,veriler!D6,\"\")","v":""},{"$f":"IF(L10>0,veriler!C6,\"\")","v":""},{"$f":"IF(L10>0,veriler!F6,\"\")","v":""},{"$f":"IF(L10>0,veriler!E6,\"\")","v":""},{"$f":"IF(L10>0,veriler!G6,\"\")","v":""},"İngilizce 9,İngilizce 11",{"$f":"IFERROR(IF(L10>0,IF(veriler!K6<veriler!AF6,veriler!K6+veriler!AG6,veriler!AF6),0),\"\")","v":0},{"$f":"IF(L10>0,IF(veriler!AJ6>0,veriler!AJ6,\"\"),0)","v":0},{"$f":"IF(L10>0,veriler!V6,0)","v":0},0,{"$f":"SUM(I10:L10)","v":0},{"$f":"IFERROR(IF(L10>0,veriler!AO6,0),\"\")","v":0},{"$f":"IF(L10>0,veriler!AL6+veriler!O6,\"\")","v":""},{"$f":"IF(L10>0,veriler!AT6,\"\")","v":""},{"$f":"IF(L10>0,veriler!AU6+veriler!AV6,\"\")","v":""},"03.10.2019 05.06.2020","Destekleme ve Yetiştirme Kursu","Perşembe\nCuma",{"$f":"IF(G10=$AC$9,ANASAYFA!$B$22,IF(G10=$AC$10,ANASAYFA!$B$28,IF(G10=$AC$11,ANASAYFA!$B$31,\"\")))","v":""},{"$f":"IFERROR(IF(P10>0,P10*U10,\"\"),\"\")","v":""},{"$f":"IF(G10=$AC$9,ANASAYFA!$B$23,IF(G10=$AC$10,ANASAYFA!$B$29,IF(G10=$AC$11,ANASAYFA!$B$32,\"\")))","v":""},{"$f":"IFERROR(IF(Q10>0,Q10*W10,\"\"),\"\")","v":""},"15:25-16:05\n16:15-16:55",null,null,null,"Y.Lisans"]
[null,{"$f":"IF(L11>0,COUNTIF($B$9:B10,\">0\")+1,0)","v":0},{"$f":"IF(L11>0,veriler!D7,\"\")","v":""},{"$f":"IF(L11>0,veriler!C7,\"\")","v":""},{"$f":"IF(L11>0,veriler!F7,\"\")","v":""},{"$f":"IF(L11>0,veriler!E7,\"\")","v":""},{"$f":"IF(L11>0,veriler!G7,\"\")","v":""},"Matematik 12",{"$f":"IFERROR(IF(L11>0,IF(veriler!K7<veriler!AF7,veriler!K7+veriler!AG7,veriler!AF7),0),\"\")","v":0},{"$f":"IF(L11>0,IF(veriler!AJ7>0,veriler!AJ7,\"\"),0)","v":0},{"$f":"IF(L11>0,veriler!V7,0)","v":0},0,0,{"$f":"IFERROR(IF(L11>0,veriler!AO7,0),\"\")","v":0},{"$f":"IF(L11>0,veriler!AL7+veriler!O7,\"\")","v":""},{"$f":"IF(L11>0,veriler!AT7,\"\")","v":""},{"$f":"IF(L11>0,veriler!AU7+veriler!AV7,\"\")","v":""},"03.10.2019 04.06.2021","Destekleme ve Yetiştirme Kursu","Cuma",{"$f":"IF(G11=$AC$9,ANASAYFA!$B$22,IF(G11=$AC$10,ANASAYFA!$B$28,IF(G11=$AC$11,ANASAYFA!$B$31,\"\")))","v":""},"",{"$f":"IF(G11=$AC$9,ANASAYFA!$B$23,IF(G11=$AC$10,ANASAYFA!$B$29,IF(G11=$AC$11,ANASAYFA!$B$32,\"\")))","v":""},"","15:25-16:05\n16:15-16:55",null,null,null,"Doktora"]
[null,{"$f":"IF(L12>0,COUNTIF($B$9:B11,\">0\")+1,0)","v":0},{"$f":"IF(L12>0,veriler!D8,\"\")","v":""},{"$f":"IF(L12>0,veriler!C8,\"\")","v":""},{"$f":"IF(L12>0,veriler!F8,\"\")","v":""},{"$f":"IF(L12>0,veriler!E8,\"\")","v":""},{"$f":"IF(L12>0,veriler!G8,\"\")","v":""},"İngilizce 9,İngilizce 12",{"$f":"IFERROR(IF(L12>0,IF(veriler!K8<veriler!AF8,veriler!K8+veriler!AG8,veriler!AF8),0),\"\")","v":0},{"$f":"IF(L12>0,IF(veriler!AJ8>0,veriler!AJ8,\"\"),0)","v":0},{"$f":"IF(L12>0,veriler!V8,0)","v":0},0,0,{"$f":"IFERROR(IF(L12>0,veriler!AO8,0),\"\")","v":0},{"$f":"IF(L12>0,veriler!AL8+veriler!O8,\"\")","v":""},{"$f":"IF(L12>0,veriler!AT8,\"\")","v":""},{"$f":"IF(L12>0,veriler!AU8+veriler!AV8,\"\")","v":""},"03.10.2019 05.06.2021","Destekleme ve Yetiştirme Kursu","Perşembe\nCuma",{"$f":"IF(G12=$AC$9,ANASAYFA!$B$22,IF(G12=$AC$10,ANASAYFA!$B$28,IF(G12=$AC$11,ANASAYFA!$B$31,\"\")))","v":""},"",{"$f":"IF(G12=$AC$9,ANASAYFA!$B$23,IF(G12=$AC$10,ANASAYFA!$B$29,IF(G12=$AC$11,ANASAYFA!$B$32,\"\")))","v":""},"","15:25-16:05\n16:15-16:55"]
[null,{"$f":"IF(L13>0,COUNTIF($B$9:B12,\">0\")+1,0)","v":0},{"$f":"IF(L13>0,veriler!D9,\"\")","v":""},{"$f":"IF(L13>0,veriler!C9,\"\")","v":""},{"$f":"IF(L13>0,veriler!F9,\"\")","v":""},{"$f":"IF(L13>0,veriler!E9,\"\")","v":""},{"$f":"IF(L13>0,veriler!G9,\"\")","v":""},"Matematik 13",{"$f":"IFERROR(IF(L13>0,IF(veriler!K9<veriler!AF9,veriler!K9+veriler!AG9,veriler!AF9),0),\"\")","v":0},{"$f":"IF(L13>0,IF(veriler!AJ9>0,veriler!AJ9,\"\"),0)","v":0},{"$f":"IF(L13>0,veriler!V9,0)","v":0},0,0,{"$f":"IFERROR(IF(L13>0,veriler!AO9,0),\"\")","v":0},{"$f":"IF(L13>0,veriler!AL9+veriler!O9,\"\")","v":""},{"$f":"IF(L13>0,veriler!AT9,\"\")","v":""},{"$f":"IF(L13>0,veriler!AU9+veriler!AV9,\"\")","v":""},"03.10.2019 04.06.2022","Destekleme ve Yetiştirme Kursu","Cumartesi",{"$f":"IF(G13=$AC$9,ANASAYFA!$B$22,IF(G13=$AC$10,ANASAYFA!$B$28,IF(G13=$AC$11,ANASAYFA!$B$31,\"\")))","v":""},"",{"$f":"IF(G13=$AC$9,ANASAYFA!$B$23,IF(G13=$AC$10,ANASAYFA!$B$29,IF(G13=$AC$11,ANASAYFA!$B$32,\"\")))","v":""},"","15:25-16:05\n16:15-16:55"]
[null,{"$f":"IF(L14>0,COUNTIF($B$9:B13,\">0\")+1,0)","v":0},{"$f":"IF(L14>0,veriler!D10,\"\")","v":""},{"$f":"IF(L14>0,veriler!C10,\"\")","v":""},{"$f":"IF(L14>0,veriler!F10,\"\")","v":""},{"$f":"IF(L14>0,veriler!E10,\"\")","v":""},{"$f":"IF(L14>0,veriler!G10,\"\")","v":""},"İngilizce 9,İngilizce 13",{"$f":"IFERROR(IF(L14>0,IF(veriler!K10<veriler!AF10,veriler!K10+veriler!AG10,veriler!AF10),0),\"\")","v":0},{"$f":"IF(L14>0,IF(veriler!AJ10>0,veriler!AJ10,\"\"),0)","v":0},{"$f":"IF(L14>0,veriler!V10,0)","v":0},0,0,{"$f":"IFERROR(IF(L14>0,veriler!AO10,0),\"\")","v":0},{"$f":"IF(L14>0,veriler!AL10+veriler!O10,\"\")","v":""},{"$f":"IF(L14>0,veriler!AT10,\"\")","v":""},{"$f":"IF(L14>0,veriler!AU10+veriler!AV10,\"\")","v":""},"03.10.2019 05.06.2022","Destekleme ve Yetiştirme Kursu","Perşembe\nCuma",{"$f":"IF(G14=$AC$9,ANASAYFA!$B$22,IF(G14=$AC$10,ANASAYFA!$B$28,IF(G14=$AC$11,ANASAYFA!$B$31,\"\")))","v":""},"",{"$f":"IF(G14=$AC$9,ANASAYFA!$B$23,IF(G14=$AC$10,ANASAYFA!$B$29,IF(G14=$AC$11,ANASAYFA!$B$32,\"\")))","v":""},"","15:25-16:05\n16:15-16:55"]
[null,{"$f":"IF(L15>0,COUNTIF($B$9:B14,\">0\")+1,0)","v":1},{"$f":"IF(L15>0,veriler!D11,\"\")","v":0},{"$f":"IF(L15>0,veriler!C11,\"\")","v":"DEMET KAYA"},{"$f":"IF(L15>0,veriler!F11,\"\")","v":"Öğretmen"},{"$f":"IF(L15>0,veriler!E11,\"\")","v":"Matematik"},{"$f":"IF(L15>0,veriler!G11,\"\")","v":"Y.Lisans"},"Matematik 14",{"$f":"IFERROR(IF(L15>0,IF(veriler!K11<veriler!AF11,veriler!K11+veriler!AG11,veriler!AF11),0),\"\")","v":0},{"$f":"IF(L15>0,IF(veriler!AJ11>0,veriler!AJ11,\"\"),0)","v":""},{"$f":"IF(L15>0,veriler!V11,0)","v":0},2,2,{"$f":"IFERROR(IF(L15>0,veriler!AO11,0),\"\")","v":0},{"$f":"IF(L15>0,veriler!AL11+veriler!O11,\"\")","v":0},{"$f":"IF(L15>0,veriler!AT11,\"\")","v":0},{"$f":"IF(L15>0,veriler!AU11+veriler!AV11,\"\")","v":0},"03.10.2019 04.06.2023","Destekleme ve Yetiştirme Kursu","Pazar",{"$f":"IF(G15=$AC$9,ANASAYFA!$B$22,IF(G15=$AC$10,ANASAYFA!$B$28,IF(G15=$AC$11,ANASAYFA!$B$31,\"\")))","v":41.919507000000003},"",{"$f":"IF(G15=$AC$9,ANASAYFA!$B$23,IF(G15=$AC$10,ANASAYFA!$B$29,IF(G15=$AC$11,ANASAYFA!$B$32,\"\")))","v":44.913757500000003},"","15:25-16:05\n16:15-16:55"]
[null,{"$f":"IF(L16>0,COUNTIF($B$9:B15,\">0\")+1,0)","v":0},{"$f":"IF(L16>0,veriler!D12,\"\")","v":""},{"$f":"IF(L16>0,veriler!C12,\"\")","v":""},{"$f":"IF(L16>0,veriler!F12,\"\")","v":""},{"$f":"IF(L16>0,veriler!E12,\"\")","v":""},{"$f":"IF(L16>0,veriler!G12,\"\")","v":""},"İngilizce 9,İngilizce 14",{"$f":"IFERROR(IF(L16>0,IF(veriler!K12<veriler!AF12,veriler!K12+veriler!AG12,veriler!AF12),0),\"\")","v":0},{"$f":"IF(L16>0,IF(veriler!AJ12>0,veriler!AJ12,\"\"),0)","v":0},{"$f":"IF(L16>0,veriler!V12,0)","v":0},0,0,{"$f":"IFERROR(IF(L16>0,veriler!AO12,0),\"\")","v":0},{"$f":"IF(L16>0,veriler!AL12+veriler!O12,\"\")","v":""},{"$f":"IF(L16>0,veriler!AT12,\"\")","v":""},{"$f":"IF(L16>0,veriler!AU12+veriler!AV12,\"\")","v":""},"03.10.2019 05.06.2023","Destekleme ve Yetiştirme Kursu","Perşembe\nCuma",{"$f":"IF(G16=$AC$9,ANASAYFA!$B$22,IF(G16=$AC$10,ANASAYFA!$B$28,IF(G16=$AC$11,ANASAYFA!$B$31,\"\")))","v":""},"",{"$f":"IF(G16=$AC$9,ANASAYFA!$B$23,IF(G16=$AC$10,ANASAYFA!$B$29,IF(G16=$AC$11,ANASAYFA!$B$32,\"\")))","v":""},"","15:25-16:05\n16:15-16:55"]
[null,{"$f":"IF(L17>0,COUNTIF($B$9:B16,\">0\")+1,0)","v":0},{"$f":"IF(L17>0,veriler!D13,\"\")","v":""},{"$f":"IF(L17>0,veriler!C13,\"\")","v":""},{"$f":"IF(L17>0,veriler!F13,\"\")","v":""},{"$f":"IF(L17>0,veriler!E13,\"\")","v":""},{"$f":"IF(L17>0,veriler!G13,\"\")","v":""},"Matematik 15",{"$f":"IFERROR(IF(L17>0,IF(veriler!K13<veriler!AF13,veriler!K13+veriler!AG13,veriler!AF13),0),\"\")","v":0},{"$f":"IF(L17>0,IF(veriler!AJ13>0,veriler!AJ13,\"\"),0)","v":0},{"$f":"IF(L17>0,veriler!V13,0)","v":0},0,0,{"$f":"IFERROR(IF(L17>0,veriler!AO13,0),\"\")","v":0},{"$f":"IF(L17>0,veriler!AL13+veriler!O13,\"\")","v":""},{"$f":"IF(L17>0,veriler!AT13,\"\")","v":""},{"$f":"IF(L17>0,veriler!AU13+veriler!AV13,\"\")","v":""},"03.10.2019 04.06.2024","Destekleme ve Yetiştirme Kursu","Pazartesi",{"$f":"IF(G17=$AC$9,ANASAYFA!$B$22,IF(G17=$AC$10,ANASAYFA!$B$28,IF(G17=$AC$11,ANASAYFA!$B$31,\"\")))","v":""},"",{"$f":"IF(G17=$AC$9,ANASAYFA!$B$23,IF(G17=$AC$10,ANASAYFA!$B$29,IF(G17=$AC$11,ANASAYFA!$B$32,\"\")))","v":""},"","15:25-16:05\n16:15-16:55"]
[null,{"$f":"IF(L18>0,COUNTIF($B$9:B17,\">0\")+1,0)","v":2},{"$f":"IF(L18>0,veriler!D14,\"\")","v":0},{"$f":"IF(L18>0,veriler!C14,\"\")","v":"CENNET ÖZKAN"},{"$f":"IF(L18>0,veriler!F14,\"\")","v":"Öğretmen"},{"$f":"IF(L18>0,veriler!E14,\"\")","v":"İngilizce"},{"$f":"IF(L18>0,veriler!G14,\"\")","v":"Lisans"},"İngilizce 9,İngilizce 15",{"$f":"IFERROR(IF(L18>0,IF(veriler!K14<veriler!AF14,veriler!K14+veriler!AG14,veriler!AF14),0),\"\")","v":0},{"$f":"IF(L18>0,IF(veriler!AJ14>0,veriler!AJ14,\"\"),0)","v":""},{"$f":"IF(L18>0,veriler!V14,0)","v":0},4,4,{"$f":"IFERROR(IF(L18>0,veriler!AO14,0),\"\")","v":0},{"$f":"IF(L18>0,veriler!AL14+veriler!O14,\"\")","v":0},{"$f":"IF(L18>0,veriler!AT14,\"\")","v":0},{"$f":"IF(L18>0,veriler!AU14+veriler!AV14,\"\")","v":0},"03.10.2019 05.06.2024","Destekleme ve Yetiştirme Kursu","Perşembe\nCuma",{"$f":"IF(G18=$AC$9,ANASAYFA!$B$22,IF(G18=$AC$10,ANASAYFA!$B$28,IF(G18=$AC$11,ANASAYFA!$B$31,\"\")))","v":40.897080000000003},"",{"$f":"IF(G18=$AC$9,ANASAYFA!$B$23,IF(G18=$AC$10,ANASAYFA!$B$29,IF(G18=$AC$11,ANASAYFA!$B$32,\"\")))","v":43.818300000000001},"","15:25-16:05\n16:15-16:55"]
[null,{"$f":"IF(L19>0,COUNTIF($B$9:B18,\">0\")+1,0)","v":0},{"$f":"IF(L19>0,veriler!D15,\"\")","v":""},{"$f":"IF(L19>0,veriler!C15,\"\")","v":""},{"$f":"IF(L19>0,veriler!F15,\"\")","v":""},{"$f":"IF(L19>0,veriler!E15,\"\")","v":""},{"$f":"IF(L19>0,veriler!G15,\"\")","v":""},"Matematik 16",{"$f":"IFERROR(IF(L19>0,IF(veriler!K15<veriler!AF15,veriler!K15+veriler!AG15,veriler!AF15),0),\"\")","v":0},{"$f":"IF(L19>0,IF(veriler!AJ15>0,veriler!AJ15,\"\"),0)","v":0},{"$f":"IF(L19>0,veriler!V15,0)","v":0},0,0,{"$f":"IFERROR(IF(L19>0,veriler!AO15,0),\"\")","v":0},{"$f":"IF(L19>0,veriler!AL15+veriler!O15,\"\")","v":""},{"$f":"IF(L19>0,veriler!AT15,\"\")","v":""},{"$f":"IF(L19>0,veriler!AU15+veriler!AV15,\"\")","v":""},"03.10.2019 04.06.2025","Destekleme ve Yetiştirme Kursu","Salı",{"$f":"IF(G19=$AC$9,ANASAYFA!$B$22,IF(G19=$AC$10,ANASAYFA!$B$28,IF(G19=$AC$11,ANASAYFA!$B$31,\"\")))","v":""},"",{"$f":"IF(G19=$AC$9,ANASAYFA!$B$23,IF(G19=$AC$10,ANASAYFA!$B$29,IF(G19=$AC$11,ANASAYFA!$B$32,\"\")))","v":""},"","15:25-16:05\n16:15-16:55"]
[null,{"$f":"IF(L20>0,COUNTIF($B$9:B19,\">0\")+1,0)","v":0},{"$f":"IF(L20>0,veriler!D16,\"\")","v":""},{"$f":"IF(L20>0,veriler!C16,\"\")","v":""},{"$f":"IF(L20>0,veriler!F16,\"\")","v":""},{"$f":"IF(L20>0,veriler!E16,\"\")","v":""},{"$f":"IF(L20>0,veriler!G16,\"\")","v":""},"İngilizce 9,İngilizce 16",{"$f":"IFERROR(IF(L20>0,IF(veriler!K16<veriler!AF16,veriler!K16+veriler!AG16,veriler!AF16),0),\"\")","v":0},{"$f":"IF(L20>0,IF(veriler!AJ16>0,veriler!AJ16,\"\"),0)","v":0},{"$f":"IF(L20>0,veriler!V16,0)","v":0},0,0,{"$f":"IFERROR(IF(L20>0,veriler!AO16,0),\"\")","v":0},{"$f":"IF(L20>0,veriler!AL16+veriler!O16,\"\")","v":""},{"$f":"IF(L20>0,veriler!AT16,\"\")","v":""},{"$f":"IF(L20>0,veriler!AU16+veriler!AV16,\"\")","v":""},"03.10.2019 05.06.2025","Destekleme ve Yetiştirme Kursu","Perşembe\nCuma",{"$f":"IF(G20=$AC$9,ANASAYFA!$B$22,IF(G20=$AC$10,ANASAYFA!$B$28,IF(G20=$AC$11,ANASAYFA!$B$31,\"\")))","v":""},"",{"$f":"IF(G20=$AC$9,ANASAYFA!$B$23,IF(G20=$AC$10,ANASAYFA!$B$29,IF(G20=$AC$11,ANASAYFA!$B$32,\"\")))","v":""},"","15:25-16:05\n16:15-16:55"]
[null,{"$f":"IF(L21>0,COUNTIF($B$9:B20,\">0\")+1,0)","v":0},{"$f":"IF(L21>0,veriler!D17,\"\")","v":""},{"$f":"IF(L21>0,veriler!C17,\"\")","v":""},{"$f":"IF(L21>0,veriler!F17,\"\")","v":""},{"$f":"IF(L21>0,veriler!E17,\"\")","v":""},{"$f":"IF(L21>0,veriler!G17,\"\")","v":""},"Matematik 17",{"$f":"IFERROR(IF(L21>0,IF(veriler!K17<veriler!AF17,veriler!K17+veriler!AG17,veriler!AF17),0),\"\")","v":0},{"$f":"IF(L21>0,IF(veriler!AJ17>0,veriler!AJ17,\"\"),0)","v":0},{"$f":"IF(L21>0,veriler!V17,0)","v":0},0,0,{"$f":"IFERROR(IF(L21>0,veriler!AO17,0),\"\")","v":0},{"$f":"IF(L21>0,veriler!AL17+veriler!O17,\"\")","v":""},{"$f":"IF(L21>0,veriler!AT17,\"\")","v":""},{"$f":"IF(L21>0,veriler!AU17+veriler!AV17,\"\")","v":""},"03.10.2019 04.06.2026","Destekleme ve Yetiştirme Kursu","Çarşamba",{"$f":"IF(G21=$AC$9,ANASAYFA!$B$22,IF(G21=$AC$10,ANASAYFA!$B$28,IF(G21=$AC$11,ANASAYFA!$B$31,\"\")))","v":""},"",{"$f":"IF(G21=$AC$9,ANASAYFA!$B$23,IF(G21=$AC$10,ANASAYFA!$B$29,IF(G21=$AC$11,ANASAYFA!$B$32,\"\")))","v":""},"","15:25-16:05\n16:15-16:55"]
[null,{"$f":"IF(L22>0,COUNTIF($B$9:B21,\">0\")+1,0)","v":0},{"$f":"IF(L22>0,veriler!D18,\"\")","v":""},{"$f":"IF(L22>0,veriler!C18,\"\")","v":""},{"$f":"IF(L22>0,veriler!F18,\"\")","v":""},{"$f":"IF(L22>0,veriler!E18,\"\")","v":""},{"$f":"IF(L22>0,veriler!G18,\"\")","v":""},"İngilizce 9,İngilizce 17",{"$f":"IFERROR(IF(L22>0,IF(veriler!K18<veriler!AF18,veriler!K18+veriler!AG18,veriler!AF18),0),\"\")","v":0},{"$f":"IF(L22>0,IF(veriler!AJ18>0,veriler!AJ18,\"\"),0)","v":0},{"$f":"IF(L22>0,veriler!V18,0)","v":0},0,0,{"$f":"IFERROR(IF(L22>0,veriler!AO18,0),\"\")","v":0},{"$f":"IF(L22>0,veriler!AL18+veriler!O18,\"\")","v":""},{"$f":"IF(L22>0,veriler!AT18,\"\")","v":""},{"$f":"IF(L22>0,veriler!AU18+veriler!AV18,\"\")","v":""},"03.10.2019 05.06.2026","Destekleme ve Yetiştirme Kursu","Perşembe\nCuma",{"$f":"IF(G22=$AC$9,ANASAYFA!$B$22,IF(G22=$AC$10,ANASAYFA!$B$28,IF(G22=$AC$11,ANASAYFA!$B$31,\"\")))","v":""},"",{"$f":"IF(G22=$AC$9,ANASAYFA!$B$23,IF(G22=$AC$10,ANASAYFA!$B$29,IF(G22=$AC$11,ANASAYFA!$B$32,\"\")))","v":""},"","15:25-16:05\n16:15-16:55"]
[null,{"$f":"IF(L23>0,COUNTIF($B$9:B22,\">0\")+1,0)","v":0},{"$f":"IF(L23>0,veriler!D19,\"\")","v":""},{"$f":"IF(L23>0,veriler!C19,\"\")","v":""},{"$f":"IF(L23>0,veriler!F19,\"\")","v":""},{"$f":"IF(L23>0,veriler!E19,\"\")","v":""},{"$f":"IF(L23>0,veriler!G19,\"\")","v":""},"Matematik 18",{"$f":"IFERROR(IF(L23>0,IF(veriler!K19<veriler!AF19,veriler!K19+veriler!AG19,veriler!AF19),0),\"\")","v":0},{"$f":"IF(L23>0,IF(veriler!AJ19>0,veriler!AJ19,\"\"),0)","v":0},{"$f":"IF(L23>0,veriler!V19,0)","v":0},0,0,{"$f":"IFERROR(IF(L23>0,veriler!AO19,0),\"\")","v":0},{"$f":"IF(L23>0,veriler!AL19+veriler!O19,\"\")","v":""},{"$f":"IF(L23>0,veriler!AT19,\"\")","v":""},{"$f":"IF(L23>0,veriler!AU19+veriler!AV19,\"\")","v":""},"03.10.2019 04.06.2027","Destekleme ve Yetiştirme Kursu","Perşembe",{"$f":"IF(G23=$AC$9,ANASAYFA!$B$22,IF(G23=$AC$10,ANASAYFA!$B$28,IF(G23=$AC$11,ANASAYFA!$B$31,\"\")))","v":""},"",{"$f":"IF(G23=$AC$9,ANASAYFA!$B$23,IF(G23=$AC$10,ANASAYFA!$B$29,IF(G23=$AC$11,ANASAYFA!$B$32,\"\")))","v":""},"","15:25-16:05\n16:15-16:55"]
[null,{"$f":"IF(L24>0,COUNTIF($B$9:B23,\">0\")+1,0)","v":0},{"$f":"IF(L24>0,veriler!D20,\"\")","v":""},{"$f":"IF(L24>0,veriler!C20,\"\")","v":""},{"$f":"IF(L24>0,veriler!F20,\"\")","v":""},{"$f":"IF(L24>0,veriler!E20,\"\")","v":""},{"$f":"IF(L24>0,veriler!G20,\"\")","v":""},"İngilizce 9,İngilizce 18",{"$f":"IFERROR(IF(L24>0,IF(veriler!K20<veriler!AF20,veriler!K20+veriler!AG20,veriler!AF20),0),\"\")","v":0},{"$f":"IF(L24>0,IF(veriler!AJ20>0,veriler!AJ20,\"\"),0)","v":0},{"$f":"IF(L24>0,veriler!V20,0)","v":0},0,0,{"$f":"IFERROR(IF(L24>0,veriler!AO20,0),\"\")","v":0},{"$f":"IF(L24>0,veriler!AL20+veriler!O20,\"\")","v":""},{"$f":"IF(L24>0,veriler!AT20,\"\")","v":""},{"$f":"IF(L24>0,veriler!AU20+veriler!AV20,\"\")","v":""},"03.10.2019 05.06.2027","Destekleme ve Yetiştirme Kursu","Perşembe\nCuma",{"$f":"IF(G24=$AC$9,ANASAYFA!$B$22,IF(G24=$AC$10,ANASAYFA!$B$28,IF(G24=$AC$11,ANASAYFA!$B$31,\"\")))","v":""},"",{"$f":"IF(G24=$AC$9,ANASAYFA!$B$23,IF(G24=$AC$10,ANASAYFA!$B$29,IF(G24=$AC$11,ANASAYFA!$B$32,\"\")))","v":""},"","15:25-16:05\n16:15-16:55"]
[null,{"$f":"IF(L25>0,COUNTIF($B$9:B24,\">0\")+1,0)","v":0},{"$f":"IF(L25>0,veriler!D21,\"\")","v":""},{"$f":"IF(L25>0,veriler!C21,\"\")","v":""},{"$f":"IF(L25>0,veriler!F21,\"\")","v":""},{"$f":"IF(L25>0,veriler!E21,\"\")","v":""},{"$f":"IF(L25>0,veriler!G21,\"\")","v":""},"Matematik 19",{"$f":"IFERROR(IF(L25>0,IF(veriler!K21<veriler!AF21,veriler!K21+veriler!AG21,veriler!AF21),0),\"\")","v":0},{"$f":"IF(L25>0,IF(veriler!AJ21>0,veriler!AJ21,\"\"),0)","v":0},{"$f":"IF(L25>0,veriler!V21,0)","v":0},0,0,{"$f":"IFERROR(IF(L25>0,veriler!AO21,0),\"\")","v":0},{"$f":"IF(L25>0,veriler!AL21+veriler!O21,\"\")","v":""},{"$f":"IF(L25>0,veriler!AT21,\"\")","v":""},{"$f":"IF(L25>0,veriler!AU21+veriler!AV21,\"\")","v":""},"03.10.2019 04.06.2028","Destekleme ve Yetiştirme Kursu","Cuma",{"$f":"IF(G25=$AC$9,ANASAYFA!$B$22,IF(G25=$AC$10,ANASAYFA!$B$28,IF(G25=$AC$11,ANASAYFA!$B$31,\"\")))","v":""},"",{"$f":"IF(G25=$AC$9,ANASAYFA!$B$23,IF(G25=$AC$10,ANASAYFA!$B$29,IF(G25=$AC$11,ANASAYFA!$B$32,\"\")))","v":""},"","15:25-16:05\n16:15-16:55"]
[null,{"$f":"IF(L26>0,COUNTIF($B$9:B25,\">0\")+1,0)","v":0},{"$f":"IF(L26>0,veriler!D22,\"\")","v":""},{"$f":"IF(L26>0,veriler!C22,\"\")","v":""},{"$f":"IF(L26>0,veriler!F22,\"\")","v":""},{"$f":"IF(L26>0,veriler!E22,\"\")","v":""},{"$f":"IF(L26>0,veriler!G22,\"\")","v":""},"İngilizce 9,İngilizce 19",{"$f":"IFERROR(IF(L26>0,IF(veriler!K22<veriler!AF22,veriler!K22+veriler!AG22,veriler!AF22),0),\"\")","v":0},{"$f":"IF(L26>0,IF(veriler!AJ22>0,veriler!AJ22,\"\"),0)","v":0},{"$f":"IF(L26>0,veriler!V22,0)","v":0},0,0,{"$f":"IFERROR(IF(L26>0,veriler!AO22,0),\"\")","v":0},{"$f":"IF(L26>0,veriler!AL22+veriler!O22,\"\")","v":""},{"$f":"IF(L26>0,veriler!AT22,\"\")","v":""},{"$f":"IF(L26>0,veriler!AU22+veriler!AV22,\"\")","v":""},"03.10.2019 05.06.2028","Destekleme ve Yetiştirme Kursu","Perşembe\nCuma",{"$f":"IF(G26=$AC$9,ANASAYFA!$B$22,IF(G26=$AC$10,ANASAYFA!$B$28,IF(G26=$AC$11,ANASAYFA!$B$31,\"\")))","v":""},"",{"$f":"IF(G26=$AC$9,ANASAYFA!$B$23,IF(G26=$AC$10,ANASAYFA!$B$29,IF(G26=$AC$11,ANASAYFA!$B$32,\"\")))","v":""},"","15:25-16:05\n16:15-16:55"]
[null,{"$f":"IF(L27>0,COUNTIF($B$9:B26,\">0\")+1,0)","v":0},{"$f":"IF(L27>0,veriler!D23,\"\")","v":""},{"$f":"IF(L27>0,veriler!C23,\"\")","v":""},{"$f":"IF(L27>0,veriler!F23,\"\")","v":""},{"$f":"IF(L27>0,veriler!E23,\"\")","v":""},{"$f":"IF(L27>0,veriler!G23,\"\")","v":""},"Matematik 20",{"$f":"IFERROR(IF(L27>0,IF(veriler!K23<veriler!AF23,veriler!K23+veriler!AG23,veriler!AF23),0),\"\")","v":0},{"$f":"IF(L27>0,IF(veriler!AJ23>0,veriler!AJ23,\"\"),0)","v":0},{"$f":"IF(L27>0,veriler!V23,0)","v":0},0,0,{"$f":"IFERROR(IF(L27>0,veriler!AO23,0),\"\")","v":0},{"$f":"IF(L27>0,veriler!AL23+veriler!O23,\"\")","v":""},{"$f":"IF(L27>0,veriler!AT23,\"\")","v":""},{"$f":"IF(L27>0,veriler!AU23+veriler!AV23,\"\")","v":""},"03.10.2019 04.06.2029","Destekleme ve Yetiştirme Kursu","Cumartesi",{"$f":"IF(G27=$AC$9,ANASAYFA!$B$22,IF(G27=$AC$10,ANASAYFA!$B$28,IF(G27=$AC$11,ANASAYFA!$B$31,\"\")))","v":""},"",{"$f":"IF(G27=$AC$9,ANASAYFA!$B$23,IF(G27=$AC$10,ANASAYFA!$B$29,IF(G27=$AC$11,ANASAYFA!$B$32,\"\")))","v":""},"","15:25-16:05\n16:15-16:55"]
[null,{"$f":"IF(L28>0,COUNTIF($B$9:B27,\">0\")+1,0)","v":0},{"$f":"IF(L28>0,veriler!D24,\"\")","v":""},{"$f":"IF(L28>0,veriler!C24,\"\")","v":""},{"$f":"IF(L28>0,veriler!F24,\"\")","v":""},{"$f":"IF(L28>0,veriler!E24,\"\")","v":""},{"$f":"IF(L28>0,veriler!G24,\"\")","v":""},"İngilizce 9,İngilizce 20",{"$f":"IFERROR(IF(L28>0,IF(veriler!K24<veriler!AF24,veriler!K24+veriler!AG24,veriler!AF24),0),\"\")","v":0},{"$f":"IF(L28>0,IF(veriler!AJ24>0,veriler!AJ24,\"\"),0)","v":0},{"$f":"IF(L28>0,veriler!V24,0)","v":0},0,0,{"$f":"IFERROR(IF(L28>0,veriler!AO24,0),\"\")","v":0},{"$f":"IF(L28>0,veriler!AL24+veriler!O24,\"\")","v":""},{"$f":"IF(L28>0,veriler!AT24,\"\")","v":""},{"$f":"IF(L28>0,veriler!AU24+veriler!AV24,\"\")","v":""},"03.10.2019 05.06.2029","Destekleme ve Yetiştirme Kursu","Perşembe\nCuma",{"$f":"IF(G28=$AC$9,ANASAYFA!$B$22,IF(G28=$AC$10,ANASAYFA!$B$28,IF(G28=$AC$11,ANASAYFA!$B$31,\"\")))","v":""},"",{"$f":"IF(G28=$AC$9,ANASAYFA!$B$23,IF(G28=$AC$10,ANASAYFA!$B$29,IF(G28=$AC$11,ANASAYFA!$B$32,\"\")))","v":""},"","15:25-16:05\n16:15-16:55"]
[null,{"$f":"IF(L29>0,COUNTIF($B$9:B28,\">0\")+1,0)","v":0},{"$f":"IF(L29>0,veriler!D25,\"\")","v":""},{"$f":"IF(L29>0,veriler!C25,\"\")","v":""},{"$f":"IF(L29>0,veriler!F25,\"\")","v":""},{"$f":"IF(L29>0,veriler!E25,\"\")","v":""},{"$f":"IF(L29>0,veriler!G25,\"\")","v":""},"Matematik 21",{"$f":"IFERROR(IF(L29>0,IF(veriler!K25<veriler!AF25,veriler!K25+veriler!AG25,veriler!AF25),0),\"\")","v":0},{"$f":"IF(L29>0,IF(veriler!AJ25>0,veriler!AJ25,\"\"),0)","v":0},{"$f":"IF(L29>0,veriler!V25,0)","v":0},0,0,{"$f":"IFERROR(IF(L29>0,veriler!AO25,0),\"\")","v":0},{"$f":"IF(L29>0,veriler!AL25+veriler!O25,\"\")","v":""},{"$f":"IF(L29>0,veriler!AT25,\"\")","v":""},{"$f":"IF(L29>0,veriler!AU25+veriler!AV25,\"\")","v":""},"03.10.2019 04.06.2030","Destekleme ve Yetiştirme Kursu","Pazar",{"$f":"IF(G29=$AC$9,ANASAYFA!$B$22,IF(G29=$AC$10,ANASAYFA!$B$28,IF(G29=$AC$11,ANASAYFA!$B$31,\"\")))","v":""},"",{"$f":"IF(G29=$AC$9,ANASAYFA!$B$23,IF(G29=$AC$10,ANASAYFA!$B$29,IF(G29=$AC$11,ANASAYFA!$B$32,\"\")))","v":""},"","15:25-16:05\n16:15-16:55"]
[null,{"$f":"IF(L30>0,COUNTIF($B$9:B29,\">0\")+1,0)","v":0},{"$f":"IF(L30>0,veriler!D26,\"\")","v":""},{"$f":"IF(L30>0,veriler!C26,\"\")","v":""},{"$f":"IF(L30>0,veriler!F26,\"\")","v":""},{"$f":"IF(L30>0,veriler!E26,\"\")","v":""},{"$f":"IF(L30>0,veriler!G26,\"\")","v":""},"İngilizce 9,İngilizce 21",{"$f":"IFERROR(IF(L30>0,IF(veriler!K26<veriler!AF26,veriler!K26+veriler!AG26,veriler!AF26),0),\"\")","v":0},{"$f":"IF(L30>0,IF(veriler!AJ26>0,veriler!AJ26,\"\"),0)","v":0},{"$f":"IF(L30>0,veriler!V26,0)","v":0},0,0,{"$f":"IFERROR(IF(L30>0,veriler!AO26,0),\"\")","v":0},{"$f":"IF(L30>0,veriler!AL26+veriler!O26,\"\")","v":""},{"$f":"IF(L30>0,veriler!AT26,\"\")","v":""},{"$f":"IF(L30>0,veriler!AU26+veriler!AV26,\"\")","v":""},"03.10.2019 05.06.2030","Destekleme ve Yetiştirme Kursu","Perşembe\nCuma",{"$f":"IF(G30=$AC$9,ANASAYFA!$B$22,IF(G30=$AC$10,ANASAYFA!$B$28,IF(G30=$AC$11,ANASAYFA!$B$31,\"\")))","v":""},"",{"$f":"IF(G30=$AC$9,ANASAYFA!$B$23,IF(G30=$AC$10,ANASAYFA!$B$29,IF(G30=$AC$11,ANASAYFA!$B$32,\"\")))","v":""},"","15:25-16:05\n16:15-16:55"]
[null,{"$f":"IF(L31>0,COUNTIF($B$9:B30,\">0\")+1,0)","v":0},{"$f":"IF(L31>0,veriler!D27,\"\")","v":""},{"$f":"IF(L31>0,veriler!C27,\"\")","v":""},{"$f":"IF(L31>0,veriler!F27,\"\")","v":""},{"$f":"IF(L31>0,veriler!E27,\"\")","v":""},{"$f":"IF(L31>0,veriler!G27,\"\")","v":""},"Matematik 22",{"$f":"IFERROR(IF(L31>0,IF(veriler!K27<veriler!AF27,veriler!K27+veriler!AG27,veriler!AF27),0),\"\")","v":0},{"$f":"IF(L31>0,IF(veriler!AJ27>0,veriler!AJ27,\"\"),0)","v":0},{"$f":"IF(L31>0,veriler!V27,0)","v":0},0,0,{"$f":"IFERROR(IF(L31>0,veriler!AO27,0),\"\")","v":0},{"$f":"IF(L31>0,veriler!AL27+veriler!O27,\"\")","v":""},{"$f":"IF(L31>0,veriler!AT27,\"\")","v":""},{"$f":"IF(L31>0,veriler!AU27+veriler!AV27,\"\")","v":""},"03.10.2019 04.06.2031","Destekleme ve Yetiştirme Kursu","Pazartesi",{"$f":"IF(G31=$AC$9,ANASAYFA!$B$22,IF(G31=$AC$10,ANASAYFA!$B$28,IF(G31=$AC$11,ANASAYFA!$B$31,\"\")))","v":""},"",{"$f":"IF(G31=$AC$9,ANASAYFA!$B$23,IF(G31=$AC$10,ANASAYFA!$B$29,IF(G31=$AC$11,ANASAYFA!$B$32,\"\")))","v":""},"","15:25-16:05\n16:15-16:55"]
[null,{"$f":"IF(L32>0,COUNTIF($B$9:B31,\">0\")+1,0)","v":0},{"$f":"IF(L32>0,veriler!D28,\"\")","v":""},{"$f":"IF(L32>0,veriler!C28,\"\")","v":""},{"$f":"IF(L32>0,veriler!F28,\"\")","v":""},{"$f":"IF(L32>0,veriler!E28,\"\")","v":""},{"$f":"IF(L32>0,veriler!G28,\"\")","v":""},"İngilizce 9,İngilizce 22",{"$f":"IFERROR(IF(L32>0,IF(veriler!K28<veriler!AF28,veriler!K28+veriler!AG28,veriler!AF28),0),\"\")","v":0},{"$f":"IF(L32>0,IF(veriler!AJ28>0,veriler!AJ28,\"\"),0)","v":0},{"$f":"IF(L32>0,veriler!V28,0)","v":0},0,0,{"$f":"IFERROR(IF(L32>0,veriler!AO28,0),\"\")","v":0},{"$f":"IF(L32>0,veriler!AL28+veriler!O28,\"\")","v":""},{"$f":"IF(L32>0,veriler!AT28,\"\")","v":""},{"$f":"IF(L32>0,veriler!AU28+veriler!AV28,\"\")","v":""},"03.10.2019 05.06.2031","Destekleme ve Yetiştirme Kursu","Perşembe\nCuma",{"$f":"IF(G32=$AC$9,ANASAYFA!$B$22,IF(G32=$AC$10,ANASAYFA!$B$28,IF(G32=$AC$11,ANASAYFA!$B$31,\"\")))","v":""},"",{"$f":"IF(G32=$AC$9,ANASAYFA!$B$23,IF(G32=$AC$10,ANASAYFA!$B$29,IF(G32=$AC$11,ANASAYFA!$B$32,\"\")))","v":""},"","15:25-16:05\n16:15-16:55"]
[null,{"$f":"IF(L33>0,COUNTIF($B$9:B32,\">0\")+1,0)","v":0},{"$f":"IF(L33>0,veriler!D29,\"\")","v":""},{"$f":"IF(L33>0,veriler!C29,\"\")","v":""},{"$f":"IF(L33>0,veriler!F29,\"\")","v":""},{"$f":"IF(L33>0,veriler!E29,\"\")","v":""},{"$f":"IF(L33>0,veriler!G29,\"\")","v":""},"Matematik 23",{"$f":"IFERROR(IF(L33>0,IF(veriler!K29<veriler!AF29,veriler!K29+veriler!AG29,veriler!AF29),0),\"\")","v":0},{"$f":"IF(L33>0,IF(veriler!AJ29>0,veriler!AJ29,\"\"),0)","v":0},{"$f":"IF(L33>0,veriler!V29,0)","v":0},0,0,{"$f":"IFERROR(IF(L33>0,veriler!AO29,0),\"\")","v":0},{"$f":"IF(L33>0,veriler!AL29+veriler!O29,\"\")","v":""},{"$f":"IF(L33>0,veriler!AT29,\"\")","v":""},{"$f":"IF(L33>0,veriler!AU29+veriler!AV29,\"\")","v":""},"03.10.2019 04.06.2032","Destekleme ve Yetiştirme Kursu","Salı",{"$f":"IF(G33=$AC$9,ANASAYFA!$B$22,IF(G33=$AC$10,ANASAYFA!$B$28,IF(G33=$AC$11,ANASAYFA!$B$31,\"\")))","v":""},"",{"$f":"IF(G33=$AC$9,ANASAYFA!$B$23,IF(G33=$AC$10,ANASAYFA!$B$29,IF(G33=$AC$11,ANASAYFA!$B$32,\"\")))","v":""},"","15:25-16:05\n16:15-16:55"]
[null,{"$f":"IF(L34>0,COUNTIF($B$9:B33,\">0\")+1,0)","v":0},{"$f":"IF(L34>0,veriler!D30,\"\")","v":""},{"$f":"IF(L34>0,veriler!C30,\"\")","v":""},{"$f":"IF(L34>0,veriler!F30,\"\")","v":""},{"$f":"IF(L34>0,veriler!E30,\"\")","v":""},{"$f":"IF(L34>0,veriler!G30,\"\")","v":""},"İngilizce 9,İngilizce 23",{"$f":"IFERROR(IF(L34>0,IF(veriler!K30<veriler!AF30,veriler!K30+veriler!AG30,veriler!AF30),0),\"\")","v":0},{"$f":"IF(L34>0,IF(veriler!AJ30>0,veriler!AJ30,\"\"),0)","v":0},{"$f":"IF(L34>0,veriler!V30,0)","v":0},0,0,{"$f":"IFERROR(IF(L34>0,veriler!AO30,0),\"\")","v":0},{"$f":"IF(L34>0,veriler!AL30+veriler!O30,\"\")","v":""},{"$f":"IF(L34>0,veriler!AT30,\"\")","v":""},{"$f":"IF(L34>0,veriler!AU30+veriler!AV30,\"\")","v":""},"03.10.2019 05.06.2032","Destekleme ve Yetiştirme Kursu","Perşembe\nCuma",{"$f":"IF(G34=$AC$9,ANASAYFA!$B$22,IF(G34=$AC$10,ANASAYFA!$B$28,IF(G34=$AC$11,ANASAYFA!$B$31,\"\")))","v":""},"",{"$f":"IF(G34=$AC$9,ANASAYFA!$B$23,IF(G34=$AC$10,ANASAYFA!$B$29,IF(G34=$AC$11,ANASAYFA!$B$32,\"\")))","v":""},"","15:25-16:05\n16:15-16:55"]
[null,{"$f":"IF(L35>0,COUNTIF($B$9:B34,\">0\")+1,0)","v":0},{"$f":"IF(L35>0,veriler!D31,\"\")","v":""},{"$f":"IF(L35>0,veriler!C31,\"\")","v":""},{"$f":"IF(L35>0,veriler!F31,\"\")","v":""},{"$f":"IF(L35>0,veriler!E31,\"\")","v":""},{"$f":"IF(L35>0,veriler!G31,\"\")","v":""},"Matematik 24",{"$f":"IFERROR(IF(L35>0,IF(veriler!K31<veriler!AF31,veriler!K31+veriler!AG31,veriler!AF31),0),\"\")","v":0},{"$f":"IF(L35>0,IF(veriler!AJ31>0,veriler!AJ31,\"\"),0)","v":0},{"$f":"IF(L35>0,veriler!V31,0)","v":0},0,0,{"$f":"IFERROR(IF(L35>0,veriler!AO31,0),\"\")","v":0},{"$f":"IF(L35>0,veriler!AL31+veriler!O31,\"\")","v":""},{"$f":"IF(L35>0,veriler!AT31,\"\")","v":""},{"$f":"IF(L35>0,veriler!AU31+veriler!AV31,\"\")","v":""},"03.10.2019 04.06.2033","Destekleme ve Yetiştirme Kursu","Çarşamba",{"$f":"IF(G35=$AC$9,ANASAYFA!$B$22,IF(G35=$AC$10,ANASAYFA!$B$28,IF(G35=$AC$11,ANASAYFA!$B$31,\"\")))","v":""},"",{"$f":"IF(G35=$AC$9,ANASAYFA!$B$23,IF(G35=$AC$10,ANASAYFA!$B$29,IF(G35=$AC$11,ANASAYFA!$B$32,\"\")))","v":""},"","15:25-16:05\n16:15-16:55"]
[null,{"$f":"IF(L36>0,COUNTIF($B$9:B35,\">0\")+1,0)","v":0},{"$f":"IF(L36>0,veriler!D32,\"\")","v":""},{"$f":"IF(L36>0,veriler!C32,\"\")","v":""},{"$f":"IF(L36>0,veriler!F32,\"\")","v":""},{"$f":"IF(L36>0,veriler!E32,\"\")","v":""},{"$f":"IF(L36>0,veriler!G32,\"\")","v":""},"İngilizce 9,İngilizce 24",{"$f":"IFERROR(IF(L36>0,IF(veriler!K32<veriler!AF32,veriler!K32+veriler!AG32,veriler!AF32),0),\"\")","v":0},{"$f":"IF(L36>0,IF(veriler!AJ32>0,veriler!AJ32,\"\"),0)","v":0},{"$f":"IF(L36>0,veriler!V32,0)","v":0},0,0,{"$f":"IFERROR(IF(L36>0,veriler!AO32,0),\"\")","v":0},{"$f":"IF(L36>0,veriler!AL32+veriler!O32,\"\")","v":""},{"$f":"IF(L36>0,veriler!AT32,\"\")","v":""},{"$f":"IF(L36>0,veriler!AU32+veriler!AV32,\"\")","v":""},"03.10.2019 05.06.2033","Destekleme ve Yetiştirme Kursu","Perşembe\nCuma",{"$f":"IF(G36=$AC$9,ANASAYFA!$B$22,IF(G36=$AC$10,ANASAYFA!$B$28,IF(G36=$AC$11,ANASAYFA!$B$31,\"\")))","v":""},"",{"$f":"IF(G36=$AC$9,ANASAYFA!$B$23,IF(G36=$AC$10,ANASAYFA!$B$29,IF(G36=$AC$11,ANASAYFA!$B$32,\"\")))","v":""},"","15:25-16:05\n16:15-16:55"]
[null,{"$f":"IF(L37>0,COUNTIF($B$9:B36,\">0\")+1,0)","v":0},{"$f":"IF(L37>0,veriler!D33,\"\")","v":""},{"$f":"IF(L37>0,veriler!C33,\"\")","v":""},{"$f":"IF(L37>0,veriler!F33,\"\")","v":""},{"$f":"IF(L37>0,veriler!E33,\"\")","v":""},{"$f":"IF(L37>0,veriler!G33,\"\")","v":""},"Matematik 25",{"$f":"IFERROR(IF(L37>0,IF(veriler!K33<veriler!AF33,veriler!K33+veriler!AG33,veriler!AF33),0),\"\")","v":0},{"$f":"IF(L37>0,IF(veriler!AJ33>0,veriler!AJ33,\"\"),0)","v":0},{"$f":"IF(L37>0,veriler!V33,0)","v":0},0,0,{"$f":"IFERROR(IF(L37>0,veriler!AO33,0),\"\")","v":0},{"$f":"IF(L37>0,veriler!AL33+veriler!O33,\"\")","v":""},{"$f":"IF(L37>0,veriler!AT33,\"\")","v":""},{"$f":"IF(L37>0,veriler!AU33+veriler!AV33,\"\")","v":""},"03.10.2019 04.06.2034","Destekleme ve Yetiştirme Kursu","Perşembe",{"$f":"IF(G37=$AC$9,ANASAYFA!$B$22,IF(G37=$AC$10,ANASAYFA!$B$28,IF(G37=$AC$11,ANASAYFA!$B$31,\"\")))","v":""},"",{"$f":"IF(G37=$AC$9,ANASAYFA!$B$23,IF(G37=$AC$10,ANASAYFA!$B$29,IF(G37=$AC$11,ANASAYFA!$B$32,\"\")))","v":""},"","15:25-16:05\n16:15-16:55"]
[null,{"$f":"IF(L38>0,COUNTIF($B$9:B37,\">0\")+1,0)","v":0},{"$f":"IF(L38>0,veriler!D34,\"\")","v":""},{"$f":"IF(L38>0,veriler!C34,\"\")","v":""},{"$f":"IF(L38>0,veriler!F34,\"\")","v":""},{"$f":"IF(L38>0,veriler!E34,\"\")","v":""},{"$f":"IF(L38>0,veriler!G34,\"\")","v":""},"İngilizce 9,İngilizce 25",{"$f":"IFERROR(IF(L38>0,IF(veriler!K34<veriler!AF34,veriler!K34+veriler!AG34,veriler!AF34),0),\"\")","v":0},{"$f":"IF(L38>0,IF(veriler!AJ34>0,veriler!AJ34,\"\"),0)","v":0},{"$f":"IF(L38>0,veriler!V34,0)","v":0},0,0,{"$f":"IFERROR(IF(L38>0,veriler!AO34,0),\"\")","v":0},{"$f":"IF(L38>0,veriler!AL34+veriler!O34,\"\")","v":""},{"$f":"IF(L38>0,veriler!AT34,\"\")","v":""},{"$f":"IF(L38>0,veriler!AU34+veriler!AV34,\"\")","v":""},"03.10.2019 05.06.2034","Destekleme ve Yetiştirme Kursu","Perşembe\nCuma",{"$f":"IF(G38=$AC$9,ANASAYFA!$B$22,IF(G38=$AC$10,ANASAYFA!$B$28,IF(G38=$AC$11,ANASAYFA!$B$31,\"\")))","v":""},"",{"$f":"IF(G38=$AC$9,ANASAYFA!$B$23,IF(G38=$AC$10,ANASAYFA!$B$29,IF(G38=$AC$11,ANASAYFA!$B$32,\"\")))","v":""},"","15:25-16:05\n16:15-16:55"]
[]
[null,"T.C."]
[null,"ULUBORLU KAYMAKAMLIĞI"]
[null,"Uluborlu Mesleki ve Teknik Anadolu Lisesi Müdürlüğü"]
[]
[null,"Sayı :"," 82452652-20-E.20434281",null,null,null,null,null,null,null,null,null,null,null,null,null,null,null,null,null,null,null,"2019-10-21"]
[null,"Konu :","Kurs Ücret  Onayı"]
[]
[null,"ULUBORLU İLÇE MİLLİ EĞİTİM MÜDÜRLÜĞÜNE"]
[]
[null,"İlgi         :","a) 657 Sayılı Devlet Memurları Kanunu."]
[null,null,"b) 439 Sayılı Kanun"]
[null,null,"c) Millî Eğitim Bakanlığı Örgün ve Yaygın Eğitimi Destekleme ve Yetiştirme Kursları Yönergesi."]
[null,null,"d) Destekleme ve Yetiştirme Kursları e-klavuzu."]
[]
[null,null,"Bakanlığımızın, ilgi (c) yönergesi ve ilgi (d) klavuzu doğrultusunda okulumuzda açılan Destekleme ve Yetiştirme Kurslarında görev alacak yönetici ve öğretmenlerin durumları yukarıdaki çizelgede sunulmuştur."]
[null,"                İlgi (b) Kanun ve Milli Eğitim Bakanlığı Yönetici ve Öğretmenlerin Ders ve Ek Ders Saatlerine İlişkin Karar doğrultusunda, okulumuzdaki takviye kurslarında ekders ücreti karşılığında görev alan yönetici ve öğretmenlerin ücretlerinin, Müdürlüğümüzce düzenlenecek aylık ücret tahakkuk cetveline göre, ilgi (a) Kanun'un 176. maddesi kapsamında ek ders ücreti olarak ödenmesi Müdürlüğümüzce uygun görülmektedir."]
[null,null,"Makamınızca da uygun görüldüğü taktirde olurlarınıza arz ederim."]
[null,null,null,null,null,null,null,null,null,null,null,null,null,null,null,null,null,null,null,null,{"$f":"ANASAYFA!B35","v":"Ruhi İLHAN"}]
[null,null,null,null,null,null,null,null,null,null,null,null,null,null,null,null,null,null,null,null,"Okul Müdürü"]
[null,null,null,null,null,null,null,null,null,null,null,null,null,null,null,null,null,null,null,null,{"$f":"ANASAYFA!C35","v":"Okul Müdürü"}]
[]
[null,"Uygun görüşle arz ederim."]
[]
[null,{"$f":"ANASAYFA!B38","v":"Ramazan GÜLMEZ"}]
[null,{"$f":"ANASAYFA!C38","v":"Şube Müdürü"}]
[]
[null,"O L U R "]
[null,"…..//10/2019"]
[]
[null,{"$f":"ANASAYFA!B36","v":"Mustafa KABASAKAL"}]
[null,{"$f":"ANASAYFA!C36","v":"İlçe Milli Eğitim Müdürü"}]
[]
[]
[]
[]
[]
[]
[]
[]
[]
[]
[null,null,null,null,null,null,null," "]